Package Details: aeskulap-dcmtkcompat 0.2.2_beta1-7

Git Clone URL: (read-only)
Package Base: aeskulap-dcmtkcompat
Description: Medical image viewer and DICOM client. Compatible with parallel installation of the package 'dcmtk'.
Upstream URL:
Licenses: GPL
Conflicts: aeskulap
Provides: aeskulap=0.2.2_beta1
Submitter: tmladek
Maintainer: None
Last Packager: tmladek
Votes: 3
Popularity: 0.141927
First Submitted: 2015-08-29 20:16
Last Updated: 2015-08-29 20:17

Latest Comments

superhdj commented on 2017-12-16 13:58

make[4]: [../../config/Makefile.def:88: ofstd.o] Error 1 make[4]: se sale del directorio '/tmp/yaourt-tmp-user/aur-aeskulap-dcmtkcompat/src/aeskulap-0.2.2-beta1/dcmtk/ofstd/libsrc' make[3]: [Makefile:38: libsrc-all] Error 2 make[3]: se sale del directorio '/tmp/yaourt-tmp-user/aur-aeskulap-dcmtkcompat/src/aeskulap-0.2.2-beta1/dcmtk/ofstd' make[2]: [Makefile:79: ofstd-libsrc-all] Error 2 make[2]: se sale del directorio '/tmp/yaourt-tmp-user/aur-aeskulap-dcmtkcompat/src/aeskulap-0.2.2-beta1/dcmtk' make[1]: [Makefile:359: all-recursive] Error 1 make[1]: se sale del directorio '/tmp/yaourt-tmp-user/aur-aeskulap-dcmtkcompat/src/aeskulap-0.2.2-beta1' make: *** [Makefile:288: all] Error 2 ==> ERROR: Se produjo un fallo en build(). Cancelando... ==> ERROR: Makepkg no ha podido compilar aeskulap-dcmtkcompat.

spease commented on 2017-09-27 02:30

Had the same problem, solved with the CXXFLAGS suggestion. Is this package still actively maintained?

Anonymous comment on 2016-06-27 14:43

The issue seems to be solved adding "-std=gnu++11 -DHAVE_PROTOTYPE_ISNAN -DHAVE_PROTOTYPE_ISINF" to CXXFLAGS

Anonymous comment on 2016-06-27 09:24

I got this error: In static member function ‘static void OFStandard::ftoa(char*, size_t, double, unsigned int, int, int)’: error: call of overloaded ‘isnan(double&)’ is ambiguous
if (isnan(val))
^ note: candidate: int isnan(double)
int isnan(double value);
In file included from ../include/dcmtk/ofstd/ofstdinc.h:187:0,
/usr/include/c++/6.1.1/cmath:648:3: note: candidate: constexpr bool std::isnan(long double)
isnan(long double __x)
make[4]: *** [../../config/Makefile.def:88: ofstd.o] Error 1

piater commented on 2016-06-24 20:17

For me, for a successful build, it suffices to add "-std=gnu++11 -DHAVE_PROTOTYPE_ISNAN -DHAVE_PROTOTYPE_ISINF" to CXXFLAGS (combating a hack with a hack).

tmladek commented on 2015-10-20 09:17

Well, you're right. I actually just copied the pkgbuild over from AUR3, without any changes except dependencies, and it compiled correctly, I don't know what changed. I'll take a look at it ASAP!

Morebikethanman commented on 2015-10-15 03:28

Unable to compile - makefile fails with error
inline operator bool() const noexcept;
Makefile:403: recipe for target 'aconfiguration.lo' failed

while trying to execute
make aconfiguration.lo