Package Details: altyo-git 0.4_rc12.1.r16.g777b7ad-1

Git Clone URL: https://aur.archlinux.org/altyo-git.git (read-only)
Package Base: altyo-git
Description: Vala / GTK+ 3 drop-down terminal emulator
Upstream URL: https://github.com/linvinus/AltYo
Licenses: GPL3
Conflicts: altyo
Provides: altyo
Submitter: willemw
Maintainer: willemw
Last Packager: willemw
Votes: 21
Popularity: 0.001601
First Submitted: 2013-02-17 09:18
Last Updated: 2015-06-08 09:06

Latest Comments

willemw commented on 2018-08-08 07:23

@bilalqayum: it is best to report this issue upstream.

The lines before the errors are:

awk: fatal: cannot open file `.install_log' for reading (No such file or directory)
glib-compile-resources --sourcedir=./data --generate-source 
./data/altyo.gresource.xml
#test -e ./altyo && rm ./altyo
valac -o altyo  -v --disable-warnings -X -DGETTEXT_PACKAGE=\"altyo\" -X -DAY_GIT_HASH=\"3ce5ecd\" -X -DAY_CHANGELOG_TAG=\"0.4_rc24-linvinus1\" --vapidir ./vapi --pkg gtk+-3.0 --pkg gdk-x11-3.0 --pkg cairo --pkg posix --pkg gmodule-2.0 -D VTE_2_91 --pkg vte-2.91 vapi/config.vapi vapi/xkb.vapi main.vala hvbox.vala altyo_terminal.vala altyo_window.vala altyo_hotkey.vala altyo_config.vala altyo_settings.vala data/altyo.c

bilalqayum commented on 2018-08-07 15:56

Hi, sorry to be pain but a minimally technical user here. Have tried to install altyo through the AUR but getting build errors, have tried clean-building but same errors, dependencies seem to be installed fine. Not sure how to begin to fix them, any help would be appreciated as AltYo seems like a great tool.

altyo_terminal.vala:1629.36-1629.40: error: Argument 1: Cannot convert from unowned string' tounowned char[]?' this.vte_term.feed_child(paste,paste.length);

altyo_terminal.vala:1750.32-1750.34: error: Argument 1: Cannot convert from unowned string?' tounowned char[]?' this.vte_term.feed_child(cmd,cmd.length);

altyo_terminal.vala:1758.34-1758.36: error: Argument 1: Cannot convert from unowned string?' tounowned char[]?' this.vte_term.feed_child(cmd,cmd.length);

altyo_terminal.vala:1778.36-1778.38: error: Argument 1: Cannot convert from unowned string?' tounowned char[]?' this.vte_term.feed_child(cmd,cmd.length);

altyo_terminal.vala:1791.36-1791.48: error: Argument 1: Cannot convert from unowned string?' tounowned char[]?' this.vte_term.feed_child(user_password,user_password.length);

Compilation failed: 5 error(s), 0 warning(s) make: *** [Makefile:84: default] Error 1 ==> ERROR: A failure occurred in build().

willemw commented on 2014-11-11 21:28

@freijon: Try again. Perhaps remove temporary build files first. Otherwise, please provide more information about the error.

freijon commented on 2014-11-11 17:33

"make" failed:

error: cc exited with status 256
Compilation failed: 1 error(s), 0 warning(s)
Makefile:63: recipe for target 'default' failed

Deth commented on 2014-10-15 18:46

Sorry about out-of-date flag, my bad - misconfiguration in temp folders :(

Deth commented on 2014-10-15 18:27

==> Starting build()...
glib-compile-resources --sourcedir=./data --generate-source ./data/altyo.gresource.xml
Can't open temp file
Makefile:70: recipe for target 'data/altyo.c' failed
make: *** [data/altyo.c] Error 1
==> ERROR: A failure occurred in build().
Aborting...
The build failed.

:(