Package Details: amule-adnza 2012.1-12

Git Clone URL: https://aur.archlinux.org/amule-adnza.git (read-only)
Package Base: amule-adnza
Description: aMule patched for Fastweb Network (Italy) by Adunanza forum
Upstream URL: http://amule-adunanza.sourceforge.net/
Licenses: GPL
Conflicts: amule, amule-adnza-svn, amule-adunanza
Provides: amule=2.3.1
Submitter: bardo
Maintainer: volalto
Last Packager: volalto
Votes: 18
Popularity: 0.000000
First Submitted: 2005-09-24 16:53
Last Updated: 2018-04-17 18:06

Latest Comments

« First ‹ Previous 1 2 3 4 Next › Last »

nTia89 commented on 2012-11-28 18:00

i've adopt the package, now it works!

zukka commented on 2012-09-09 07:57

adding this patch makes compilation work

--- aMule-AdunanzA-2010.1-2.2.6/src/ObservableQueue.h 2010-02-03 18:14:39.000000000 +0100
+++ aMule-AdunanzA-2010.1-2.2.6_patched/src/ObservableQueue.h 2012-09-09 09:37:58.019977161 +0200
@@ -331,14 +331,14 @@
template <typename ValueType>
void CObservableQueue<ValueType>::ObserverAdded( ObserverType* o )
{
- NotifyObservers( EventType( EventType::STARTING ), o );
+ this->NotifyObservers( EventType( EventType::STARTING ), o );
}


template <typename ValueType>
void CObservableQueue<ValueType>::ObserverRemoved( ObserverType* o )
{
- NotifyObservers( EventType( EventType::STOPPING ), o );
+ this->NotifyObservers( EventType( EventType::STOPPING ), o );
}


kiodo1981 commented on 2012-09-09 07:00

make[3]: *** [amule-DownloadQueue.o] Errore 1
make[2]: *** [all-recursive] Errore 1
make[1]: *** [all-recursive] Errore 1
make: *** [all] Errore 2
==> ERRORE: Si è verificato un errore in build().
L'operazione sta per essere interrotta...

Ho risolto usando il pacchetto CCR di chakra. Non la trovo la migliore soluzione.

lantuin commented on 2012-08-16 09:52

amule-adnza is a package that differs from amule, it must be used only by Fastweb users. This is the last available version so it's the most update.

hepha commented on 2012-07-10 15:08

will add this patch fix make bug
http://bugs.debian.org/cgi-bin/bugreport.cgi?msg=10;bug=674375

i use to amule-dlp cat work

alexiobash commented on 2012-06-09 10:33

very good pkg!!!

barchiesi commented on 2012-05-24 20:01

In file included from DownloadQueue.h:30:0,
from DownloadQueue.cpp:26:
ObservableQueue.h: In instantiation of ‘void CObservableQueue<ValueType>::ObserverAdded(CObservableQueue<ValueType>::ObserverType*) [with ValueType = CPartFile*; CObservableQueue<ValueType>::ObserverType = CObserver<CQueueEvent<CPartFile*> >]’:
DownloadQueue.cpp:1597:32: required from here
ObservableQueue.h:334:2: error: ‘NotifyObservers’ was not declared in this scope, and no declarations were found by argument-dependent lookup at the point of instantiation [-fpermissive]
ObservableQueue.h:334:2: note: declarations in dependent base ‘CObservable<CQueueEvent<CPartFile*> >’ are not found by unqualified lookup
ObservableQueue.h:334:2: note: use ‘this->NotifyObservers’ instead
ObservableQueue.h: In instantiation of ‘void CObservableQueue<ValueType>::ObserverRemoved(CObservableQueue<ValueType>::ObserverType*) [with ValueType = CPartFile*; CObservableQueue<ValueType>::ObserverType = CObserver<CQueueEvent<CPartFile*> >]’:
DownloadQueue.cpp:1753:1: required from here
ObservableQueue.h:341:2: error: ‘NotifyObservers’ was not declared in this scope, and no declarations were found by argument-dependent lookup at the point of instantiation [-fpermissive]
ObservableQueue.h:341:2: note: declarations in dependent base ‘CObservable<CQueueEvent<CPartFile*> >’ are not found by unqualified lookup
ObservableQueue.h:341:2: note: use ‘this->NotifyObservers’ instead
make[3]: *** [amule-DownloadQueue.o] Error 1
make[3]: *** Waiting for unfinished jobs....
make[2]: *** [all-recursive] Error 1
make[1]: *** [all-recursive] Error 1
make: *** [all] Error 2

Anonymous comment on 2011-04-18 18:48

Hi gborzi,
thanks for reporting. I removed cvs and perl (it's required by gd yet) from makedeps and moved crypto++ to deps (I can't start amule without it). I didn't bump pkgrel, no need to force a rebuild here I think.
Sorry for late response.

gborzi commented on 2011-04-08 15:44

Please remove cvs from makedepends, it isn't needed to compile the package.

Anonymous comment on 2010-10-30 11:04

@ garrett
You have to rebuild amule-adnza, latest libupnp pkg provides libupnp.so.4. I already did it a few days ago. Maintaining aur pkgs is up to users who install them.