Package Details: android-apktool-git 2.0.0.RC4.r20.gbbc6023-1

Git Clone URL: https://aur.archlinux.org/android-apktool-git.git (read-only)
Package Base: android-apktool-git
Description: a tool for reengineering Android apk files
Upstream URL: https://code.google.com/p/android-apktool/
Licenses: Apache 2.0
Conflicts: android-apktool
Submitter: Manouchehri
Maintainer: Manouchehri
Last Packager: Manouchehri
Votes: 3
Popularity: 0.000000
First Submitted: 2013-11-01 22:16
Last Updated: 2015-12-16 18:59

Latest Comments

Manouchehri commented on 2015-12-16 19:01

Done.

HaoZeke commented on 2015-12-04 14:16

Hey, please update the build() portion to include
./gradlew applyPatches

Manouchehri commented on 2015-10-08 18:19

I'm already using that repository?

MreDD commented on 2015-10-08 17:35

his work has been moved to github.
https://github.com/iBotPeaches/Apktool

Manouchehri commented on 2015-03-12 20:50

Version bump. Is everyone okay with the version name or would you prefer if I shortened it?

Manouchehri commented on 2014-12-09 04:22

Fixed the version number again.

Manouchehri commented on 2014-11-26 19:01

Updated. I'm not sure why Oracle's JDK didn't have a aapt path problem but OpenJDK did.. Should be fixed either way, left the warning message just in case.

Manouchehri commented on 2014-05-31 01:24

It still fails to build with OpenJDK here. It has always run fine under OpenJDK, but it can't be built with anything but the standard JDK. That's why I set makedepends to jdk7 and depends to just java-runtime (which allows either).

brut.androlib.AaptTest > isAaptInstalledTest FAILED
java.lang.AssertionError: expected:<true> but was:<false>
at org.junit.Assert.fail(Assert.java:93)
at org.junit.Assert.failNotEquals(Assert.java:647)
at org.junit.Assert.assertEquals(Assert.java:128)
at org.junit.Assert.assertEquals(Assert.java:147)
at brut.androlib.AaptTest.isAaptInstalledTest(AaptTest.java:32)

33 tests completed, 1 failed
:brut.apktool:apktool-lib:test FAILED

FAILURE: Build failed with an exception.

Manouchehri commented on 2014-05-31 01:23

It still fails to build with OpenJDK here. It has always run fine under OpenJDK, but it can't be built with anything but the standard JDK.

brut.androlib.AaptTest > isAaptInstalledTest FAILED
java.lang.AssertionError: expected:<true> but was:<false>
at org.junit.Assert.fail(Assert.java:93)
at org.junit.Assert.failNotEquals(Assert.java:647)
at org.junit.Assert.assertEquals(Assert.java:128)
at org.junit.Assert.assertEquals(Assert.java:147)
at brut.androlib.AaptTest.isAaptInstalledTest(AaptTest.java:32)

33 tests completed, 1 failed
:brut.apktool:apktool-lib:test FAILED

FAILURE: Build failed with an exception.

urimon commented on 2014-05-30 17:09

Openjdk seems to work with the git version now

Manouchehri commented on 2014-04-24 05:34

I fixed the version number.

Manouchehri commented on 2014-04-19 06:04

Version number is still a bit funky, I'll look into that later.

Manouchehri commented on 2013-11-23 13:57

Rewritten.

Manouchehri commented on 2013-11-16 10:14

It appears something broke... Will have to look into it.