Package Details: apper-git r1253.44b7c88-1

Git Clone URL: https://aur.archlinux.org/apper-git.git (read-only, click to copy)
Package Base: apper-git
Description: An application and package manager using PackageKit
Upstream URL: https://userbase.kde.org/Apper
Licenses: LGPL
Conflicts: apper
Provides: apper
Submitter: Loose_Control
Maintainer: None
Last Packager: micwoj92
Votes: 17
Popularity: 0.000000
First Submitted: 2011-05-04 17:54
Last Updated: 2020-09-14 04:10

Latest Comments

« First ‹ Previous 1 2 3 4 Next › Last »

mrbit commented on 2012-09-18 08:07

package 'packagekit-qt2>=0.8.4' not found ??

Apper detected that you use a 64 bit processor. Added -fPIC to the CXX_FLAGS.
-- Found KDE4Workspace: /usr/lib/cmake/KDE4Workspace/KDE4WorkspaceConfig.cmake
-- Configuring incomplete, errors occurred!

mrbit commented on 2012-09-18 08:06

package 'packagekit-qt2>=0.8.4' not found ???

mrbit commented on 2012-08-26 14:13

- QPK includ dir: /PackageKit/packagekit-qt2
-- Apper detected that you use a 64 bit processor. Added -fPIC to the CXX_FLAGS.
-- Found KDE4Workspace: /usr/lib/cmake/KDE4Workspace/KDE4WorkspaceConfig.cmake
-- Configuring incomplete, errors occurred!

Loose_Control commented on 2012-08-06 16:10

apper-git isn't building right now...

Anonymous comment on 2012-07-25 06:39

Same here, x64 system fully updated.

mrbit commented on 2012-07-23 07:22

[ 7%] Building CXX object libapper/CMakeFiles/apper.dir/apper_automoc.cpp.o
In file included from /tmp/packerbuild-0/apper-git/apper-git/src/build/libapper/moc_SimulateModel.cpp:10:0,
from /tmp/packerbuild-0/apper-git/apper-git/src/build/libapper/apper_automoc.cpp:7:
/tmp/packerbuild-0/apper-git/apper-git/src/build/libapper/../../apper/libapper/SimulateModel.h:42:32: error: ‘PackageList’ does not name a type
/tmp/packerbuild-0/apper-git/apper-git/src/build/libapper/../../apper/libapper/SimulateModel.h:42:45: error: ISO C++ forbids declaration of ‘skipPackages’ with no type [-fpermissive]
/tmp/packerbuild-0/apper-git/apper-git/src/build/libapper/../../apper/libapper/SimulateModel.h:53:26: error: ‘PackageList’ was not declared in this scope
/tmp/packerbuild-0/apper-git/apper-git/src/build/libapper/../../apper/libapper/SimulateModel.h:53:37: error: template argument 2 is invalid
/tmp/packerbuild-0/apper-git/apper-git/src/build/libapper/../../apper/libapper/SimulateModel.h:54:5: error: ‘PackageList’ does not name a type
make[2]: *** [libapper/CMakeFiles/apper.dir/apper_automoc.cpp.o] Errore 1
make[1]: *** [libapper/CMakeFiles/apper.dir/all] Errore 2
make: *** [all] Errore 2

Anonymous comment on 2012-04-15 00:27

'git' should be added to makedepends ;)

Anonymous comment on 2012-03-28 23:19

subversion is not required in makedepends, this is a git package.

Anonymous comment on 2012-02-22 00:44

Running the built package against namcap gives this:

apper-git E: Insecure RPATH '/home/medhefgo/apper-git/src/build/lib' in file ('usr/bin/apper')
apper-git W: Referenced library 'libapper.so' is an uninstalled dependency
apper-git E: Mime type handler found. Add "update-desktop-database -q" to the install file
apper-git W: Dependency kdelibs included but already satisfied

I don't like what it says. Same with apper package.

divansantana commented on 2011-10-11 18:04

woops thanks. :)