Package Details: apper-git r1253.44b7c88-1

Git Clone URL: https://aur.archlinux.org/apper-git.git (read-only, click to copy)
Package Base: apper-git
Description: An application and package manager using PackageKit
Upstream URL: https://userbase.kde.org/Apper
Licenses: LGPL
Conflicts: apper
Provides: apper
Submitter: Loose_Control
Maintainer: None
Last Packager: micwoj92
Votes: 17
Popularity: 0.000000
First Submitted: 2011-05-04 17:54
Last Updated: 2020-09-14 04:10

Latest Comments

« First ‹ Previous 1 2 3 4 Next › Last »

Loose_Control commented on 2011-10-11 16:30

lol why should the git version be outdated? -.-

for the newest stable version:
https://aur.archlinux.org/packages.php?ID=53061

Loose_Control commented on 2011-10-11 16:29

lol why should the git version be outdated? -.-

divansantana commented on 2011-10-11 15:42

I think this is out of date now, https://dantti.wordpress.com/2011/10/10/apper-released/

Any new package available anywhere? :)

dimitar commented on 2011-09-11 19:44

I replaced kpackagekit with apper and it works without any problems. I like very much the improvements in comparison to kpackagekit!

ying commented on 2011-05-20 08:39

Hmm not very stable. I will fallback to kpackagekit.

ying commented on 2011-05-20 08:27

Great!

Loose_Control commented on 2011-05-19 09:20

it's working now ;)

ying commented on 2011-05-17 20:39

I marked it.

Quote:Yes it doesnt compile right now wait till the developer has fixed the problem...

That takes time.. ;)

Loose_Control commented on 2011-05-17 15:55

Yes it doesnt compile right now wait till the developer has fixed the problem...

and the package is not out of date who marked it as one?

ying commented on 2011-05-17 09:20

Can't compile!

CMakeFiles/apper.dir/ApperKCM.o: In function `ApperKCM::save()':
ApperKCM.cpp:(.text+0x3e81): undefined reference to `PkTransaction::PkTransaction(PackageKit::Transaction*, QWidget*)'
ApperKCM.cpp:(.text+0x4131): undefined reference to `PkTransaction::installPackages(QList<PackageKit::Package> const&)'
ApperKCM.cpp:(.text+0x4139): undefined reference to `PkTransaction::isFinished() const'
ApperKCM.cpp:(.text+0x4149): undefined reference to `PkTransaction::exitStatus() const'
ApperKCM.cpp:(.text+0x4175): undefined reference to `PkTransaction::removePackages(QList<PackageKit::Package> const&)'
ApperKCM.cpp:(.text+0x417d): undefined reference to `PkTransaction::isFinished() const'
ApperKCM.cpp:(.text+0x4239): undefined reference to `PkTransaction::exitStatus() const'
ApperKCM.cpp:(.text+0x4414): undefined reference to `PkTransaction::updatePackages(QList<PackageKit::Package> const&)'
ApperKCM.cpp:(.text+0x4429): undefined reference to `PkTransaction::isFinished() const'
collect2: ld gab 1 als Ende-Status zurück
make[2]: *** [lib/apper.so] Fehler 1
make[1]: *** [ApperKCM/CMakeFiles/apper.dir/all] Fehler 2
make: *** [all] Fehler 2