Package Details: aria2-fast 1.23.0-1

Git Clone URL: https://aur.archlinux.org/aria2-fast.git (read-only)
Package Base: aria2-fast
Description: Aria2 Download utility with little patch to maximize aria2 download speed
Upstream URL: http://aria2.sourceforge.net/
Licenses: GPL
Conflicts: aria2
Provides: aria2
Submitter: agus.winger
Maintainer: pandada8
Last Packager: pandada8
Votes: 6
Popularity: 0.150655
First Submitted: 2012-05-31 12:24
Last Updated: 2016-05-17 06:09

Required by (26)

Sources (2)

Latest Comments

ryansito commented on 2016-01-11 22:00

@pandada8 I've fixed it, I was blocking the multicast port so I've opened it in the firewall. Thanks!!

ryansito commented on 2016-01-10 19:01

@pandada8 thanks I'll try.

pandada8 commented on 2016-01-10 04:57

@ryansito no problem here
BTW, this patch would not let the test fail, try rebuild or build the original "aria2" package to see if any test failed

ryansito commented on 2016-01-10 03:29

Won't build for me with a check error.
CXXLD aria2c
make[2]: Leaving directory '/home/user/Downloads/aria2-fast/src/aria2-1.19.3/test'
make check-TESTS
make[2]: Entering directory '/home/user/Downloads/aria2-fast/src/aria2-1.19.3/test'
make[3]: Entering directory '/home/user/Downloads/aria2-fast/src/aria2-1.19.3/test'
FAIL: aria2c
============================================================================
Testsuite summary for aria2 1.19.3
============================================================================
# TOTAL: 1
# PASS: 0
# SKIP: 0
# XFAIL: 0
# FAIL: 1
# XPASS: 0
# ERROR: 0
============================================================================
See test/test-suite.log
Please report to https://github.com/tatsuhiro-t/aria2/issues
============================================================================
Makefile:1391: recipe for target 'test-suite.log' failed
make[3]: *** [test-suite.log] Error 1
make[3]: Leaving directory '/home/user/Downloads/aria2-fast/src/aria2-1.19.3/test'
Makefile:1497: recipe for target 'check-TESTS' failed
make[2]: *** [check-TESTS] Error 2
make[2]: Leaving directory '/home/user/Downloads/aria2-fast/src/aria2-1.19.3/test'
Makefile:1570: recipe for target 'check-am' failed
make[1]: *** [check-am] Error 2
make[1]: Leaving directory '/home/user/Downloads/aria2-fast/src/aria2-1.19.3/test'
Makefile:540: recipe for target 'check-recursive' failed
make: *** [check-recursive] Error 1
==> ERROR: A failure occurred in check().

pandada8 commented on 2015-09-29 15:50

the patch is udpated

sp1d3rmxn commented on 2015-03-30 11:25

Fails compilation (surprise, surprise):

If you have the time go in to whatever directory it was being built and in the cool testsuite file that has such explicit detail you see this:

------------------------------------------------------------------------------

03/30 06:15:15 [DEBUG] priority=999999 url=http://base/dir/example.ext
.................Exception: [metalink_helper.cc:152] errorCode=20 Could not parse Metalink XML document.

.Exception: [metalink_helper.cc:152] errorCode=20 Could not parse Metalink XML document.

..............

##Failure Location unknown## : Error
Test name: aria2::LpdMessageDispatcherTest::testSendMessage
uncaught exception of type aria2::DlAbortEx
- Failed to set a socket option, cause: No such device

LpdMessageReceiverTest.cc:34:Assertion
Test name: aria2::LpdMessageReceiverTest::testReceiveMessage
assertion failed
- Expression: rcv.init("")

Failures !!!
Run: 972 Failure total: 2 Failures: 1 Errors: 1

-------------------------------------------------------------------------------


So what XML document are we looking for that needs to be parsed (not familiar with any website calling itself "base")? Who knows must be a magic one that appears at random depending on whether you scratched your ass before compiling.

Maybe it's trying to reach an external site? Might be kinda hard if you ignore my proxy settings, yes http_ and https_ have been set for half a year now. Funny this compiled no problem the first time under these same exact conditions (machine config not changed).

I'm lovin it!

agus.winger commented on 2012-12-16 06:08

update patch for version 1.16.x

previous patch won't work for this aria2 version

Change piece-lenght and min-split size default value because they were to small before

agus.winger commented on 2012-06-06 15:21

thanks for your suggestion i'll fix it

sva_h4cky0 commented on 2012-06-06 13:30

please add "provides=('aria2')", thanks b4

agus.winger commented on 2012-05-31 13:07

I'sorry for aria2 developer because i messed your hard work become like this