Package Details: aria2-git 1.22.0.30.ge174b90-2

Git Clone URL: https://aur.archlinux.org/aria2-git.git (read-only)
Package Base: aria2-git
Description: Download utility that supports HTTP(S), FTP, BitTorrent, and Metalink
Upstream URL: http://aria2.sourceforge.net/
Licenses: GPL
Conflicts: aria2
Provides: aria2=1.22.0.30
Submitter: pumbur
Maintainer: oats
Last Packager: oats
Votes: 8
Popularity: 1.463930
First Submitted: 2011-05-22 01:07
Last Updated: 2016-05-19 20:23

Required by (27)

Sources (1)

Latest Comments

Alad commented on 2016-04-26 10:25

https://ptpb.pw/H-Gk

Alad commented on 2016-04-26 10:23

Easiest is to drop the python-sphinx makedepends, which the repo version doesn't have either.

Alad commented on 2016-04-19 12:08

Fails on translations:

Build finished. The manual pages are in _build/man.
make[5]: Leaving directory '/home/aur/aria2-git/src/aria2/doc/manual-src/en'
make[4]: Leaving directory '/home/aur/aria2-git/src/aria2/doc/manual-src/en'
Making all in ru
make[4]: Entering directory '/home/aur/aria2-git/src/aria2/doc/manual-src/ru'
make man
make[5]: Entering directory '/home/aur/aria2-git/src/aria2/doc/manual-src/ru'
sphinx-build -b man -d _build/doctrees -c . . _build/man
Running Sphinx v1.4.1
making output directory...
loading translations [ru]...
Exception occurred:
File "/usr/lib/python3.5/site-packages/sphinx/util/i18n.py", line 58, in write_mo
with io.open(self.mo_path, 'wb') as mo:
PermissionError: [Errno 13] Permission denied: '/usr/lib/python3.5/site-packages/sphinx/locale/ru/LC_MESSAGES/sphinx.mo'
The full traceback has been saved in /tmp/sphinx-err-0w7vww8_.log, if you want to report the issue to the developers.
Please also report this if it was a user error, so that a better error message can be provided next time.
A bug report can be filed in the tracker at <https://github.com/sphinx-doc/sphinx/issues>. Thanks!
Makefile:734: recipe for target 'man' failed
make[5]: *** [man] Error 1
make[5]: Leaving directory '/home/aur/aria2-git/src/aria2/doc/manual-src/ru'
Makefile:629: recipe for target '_build/man/aria2c.1' failed
make[4]: *** [_build/man/aria2c.1] Error 2
make[4]: Leaving directory '/home/aur/aria2-git/src/aria2/doc/manual-src/ru'
Makefile:447: recipe for target 'all-recursive' failed
make[3]: *** [all-recursive] Error 1
make[3]: Leaving directory '/home/aur/aria2-git/src/aria2/doc/manual-src'
Makefile:554: recipe for target 'all-recursive' failed
make[2]: *** [all-recursive] Error 1
make[2]: Leaving directory '/home/aur/aria2-git/src/aria2/doc'
Makefile:559: recipe for target 'all-recursive' failed
make[1]: *** [all-recursive] Error 1
make[1]: Leaving directory '/home/aur/aria2-git/src/aria2'
Makefile:470: recipe for target 'all' failed
make: *** [all] Error 2
==> ERROR: A failure occurred in build().
Aborting...

% cat /tmp/sphinx-err-0w7vww8_.log
# Sphinx version: 1.4.1
# Python version: 3.5.1 (CPython)
# Docutils version: 0.12 release
# Jinja2 version: 2.8
# Last messages:

# Loaded extensions:
Traceback (most recent call last):
File "/usr/lib/python3.5/site-packages/sphinx/cmdline.py", line 243, in main
opts.warningiserror, opts.tags, opts.verbosity, opts.jobs)
File "/usr/lib/python3.5/site-packages/sphinx/application.py", line 189, in __init__
self._init_i18n()
File "/usr/lib/python3.5/site-packages/sphinx/application.py", line 214, in _init_i18n
charset=self.config.source_encoding)
File "/usr/lib/python3.5/site-packages/sphinx/locale/__init__.py", line 217, in init
catinfo.write_mo(language)
File "/usr/lib/python3.5/site-packages/sphinx/util/i18n.py", line 58, in write_mo
with io.open(self.mo_path, 'wb') as mo:
PermissionError: [Errno 13] Permission denied: '/usr/lib/python3.5/site-packages/sphinx/locale/ru/LC_MESSAGES/sphinx.mo'

Alad commented on 2016-04-19 11:57

Please quote $pkgdir (actual quotes, no curly braces) so the build doesn't fail in directories with spaces.

flu commented on 2013-03-08 14:11

Compilation fails with:
sphinx-build: Command not found
Plus, aria2.d is not needed anymore.