Package Details: armory-goatpig-git v0.96.5.r0.g1d02a664-2

Git Clone URL: (read-only, click to copy)
Package Base: armory-goatpig-git
Description: Armory Bitcoin wallet, built from new, official github repo w/auto selection of current python2 version
Upstream URL:
Licenses: AGPL3
Conflicts: armory, armory-bin, armory-git
Provides: armory
Submitter: uncle
Maintainer: uncle
Last Packager: uncle
Votes: 3
Popularity: 0.000000
First Submitted: 2016-03-27 00:25 (UTC)
Last Updated: 2019-01-24 02:27 (UTC)

Latest Comments

uncle commented on 2017-11-14 21:55 (UTC)

Digger, this is probably happening because you have previously installed armory using a different package name (probably armory-bin, which I will add to the conflicting packages). Uninstall the old one first, then try installing this package again.

digger commented on 2017-11-10 02:54 (UTC)

It looks like there are packages that conflict: $ sudo pacman -U armory-goatpig-git-v0.96.3.r0.g2b65ac06-1-x86_64.pkg.tar.xz loading packages... resolving dependencies... looking for conflicting packages... Packages (1) armory-goatpig-git-v0.96.3.r0.g2b65ac06-1 Total Installed Size: 30.60 MiB :: Proceed with installation? [Y/n] (1/1) checking keys in keyring [######################] 100% (1/1) checking package integrity [######################] 100% (1/1) loading package files [######################] 100% (1/1) checking for file conflicts [######################] 100% error: failed to commit transaction (conflicting files) armory-goatpig-git: /usr/include/fastcgi.h exists in filesystem armory-goatpig-git: /usr/include/fcgi_config.h exists in filesystem armory-goatpig-git: /usr/include/fcgi_stdio.h exists in filesystem armory-goatpig-git: /usr/include/fcgiapp.h exists in filesystem armory-goatpig-git: /usr/include/fcgimisc.h exists in filesystem armory-goatpig-git: /usr/include/fcgio.h exists in filesystem armory-goatpig-git: /usr/include/fcgios.h exists in filesystem armory-goatpig-git: /usr/lib/ exists in filesystem armory-goatpig-git: /usr/lib/ exists in filesystem armory-goatpig-git: /usr/lib/ exists in filesystem Errors occurred, no packages were upgraded.

uncle commented on 2017-08-31 07:25 (UTC)

Updated to 0.96.2. With this release, Armory allows the use of segwit addresses. NOTE: The "coin control" bug I was experiencing appears to have been one unique to my wallet, and one which I have since remedied.

uncle commented on 2017-08-26 01:42 (UTC) (edited on 2017-08-27 16:46 (UTC) by uncle)

EDIT: Latest testing version is still freezing, use the stable version. There is a bug in 0.96.1 and 0.96.2 RC2 which, after using the "coin control" menu once to create a transaction, will cause Armory to freeze if you try to use the "coin control" menu again. This bug is fixed in the latest version of the testing repo (not in the 0.96.2 RC2 binary). if you wish to install the testing version (do so at your own risk, of course) you may do so by editing the PKGBUILD before installation, and adding "#branch=testing" (without the quotes) at the end of the "source" address. continue building the package, and it will install the latest version from testing. Again, do so at your own risk ;-)

uncle commented on 2017-08-26 01:36 (UTC)

@mmanjos I updated the PKGBUILD to fix the problem you pointed out, thanks for the feedback. the makefile assumes that qt4 version of lrelease is named "lrelease" but since Arch tends to be bleeding edge, it assumes qt5 is the default version, and installs the qt5 version of lrelease (included in the "qt5-tools" package) as "lrelease" and the qt4 version as "lrelease-qt4". Now the PKGBUILD updates the command in the makefile so that it uses the correct qt4 version when the package is compiled.

mmanjos commented on 2017-08-09 04:39 (UTC) (edited on 2017-08-09 04:39 (UTC) by mmanjos)

Experienced a failure to build today. Making /usr/bin/lrelease-qt4 symlink to /usr/bin/lrelease temporarily resolved the issue. Failure below: checking for lrelease... no configure: error: missing lrelease in path, make sure qt4-linguist-tools is installed ==> ERROR: A failure occurred in build(). Aborting... warning: package armory-goatpig-git failed to build, skipping

uncle commented on 2017-07-28 07:00 (UTC)

Updated to 0.96.1, and removed twisted dependency (as of 0.96.1 twisted/python2-twisted dependency is no longer needed).

bobpaul commented on 2017-07-28 00:47 (UTC)

I built this fine today, but had to change the dependency on "twisted" to "python2-twisted".

uncle commented on 2017-07-10 20:40 (UTC)

This should be fixed in the next update, which will probably be arriving soon (currently at beta #4)

bosma commented on 2017-06-09 03:23 (UTC)

Failing to build with: libtool: compile: g++ -std=c++11 -DHAVE_CONFIG_H -I. -I.. -D_FORTIFY_SOURCE=2 -march=x86-64 -mtune=generic -O2 -pipe -fstack-protector-strong -O2 -std=c++11 -Ilmdb -Icryptopp -I/usr/include/python2.7 -D__STDC_LIMIT_MACROS -march=x86-64 -mtune=generic -O2 -pipe -fstack-protector-strong -O2 -MT libCppBlockUtils_la-Wallets.lo -MD -MP -MF .deps/libCppBlockUtils_la-Wallets.Tpo -c Wallets.cpp -o libCppBlockUtils_la-Wallets.o >/dev/null 2>&1 mv -f .deps/libCppBlockUtils_la-WalletManager.Tpo .deps/libCppBlockUtils_la-WalletManager.Plo mv -f .deps/ArmoryDB-BDM_Server.Tpo .deps/ArmoryDB-BDM_Server.Po mv -f .deps/libCppBlockUtils_la-Signer.Tpo .deps/libCppBlockUtils_la-Signer.Plo mv -f .deps/ArmoryDB-BDM_supportClasses.Tpo .deps/ArmoryDB-BDM_supportClasses.Po mv -f .deps/libCppBlockUtils_la-SwigClient.Tpo .deps/libCppBlockUtils_la-SwigClient.Plo mv -f .deps/libCppBlockUtils_la-Script.Tpo .deps/libCppBlockUtils_la-Script.Plo mv -f .deps/libCppBlockUtils_la-Wallets.Tpo .deps/libCppBlockUtils_la-Wallets.Plo make[3]: Leaving directory '/home/bosma/.cache/pacaur/armory-goatpig-git/src/armory/cppForSwig' make[2]: *** [Makefile:1445: all-recursive] Error 1 make[2]: Leaving directory '/home/bosma/.cache/pacaur/armory-goatpig-git/src/armory/cppForSwig' make[1]: *** [Makefile:429: all-recursive] Error 1 make[1]: Leaving directory '/home/bosma/.cache/pacaur/armory-goatpig-git/src/armory' make: *** [Makefile:361: all] Error 2 ==> ERROR: A failure occurred in build(). Aborting... using g++ (GCC) 7.1.1 20170516

uncle commented on 2017-05-09 21:46 (UTC)

I added icoutils as a makedepend, thanks for letting me know.

Frans-Willem commented on 2017-05-09 17:39 (UTC)

icoutils dependency is still missing.

DigitalPioneer commented on 2017-05-08 01:50 (UTC) (edited on 2017-05-08 01:52 (UTC) by DigitalPioneer)

Missing (build?) dep: icoutils Edit: Oh, looks like you updated the package for the new build system, so I'm not certain if that's still true... but unless they stopped using icotool, it probably is.

s1kx commented on 2017-05-03 10:44 (UTC)

Armory v0.96 has introduced the use of autotools, therefore changing the build process. Please look at to see how armory needs to be built now: - git submodule libfcgi needs to be pulled - PYTHON_VERSION needs to be set Compilation: PYTHON_VERSION=... ./ PYTHON_VERSION=... ./compile make

uncle commented on 2017-03-24 05:33 (UTC)

thank you @md2prof! I added rsync to the depends :-)

md2prof commented on 2017-03-18 22:05 (UTC)

Thanks for this package! Just a note - you should add rsync to your depends. Fails without it.

uncle commented on 2016-11-21 06:28 (UTC)

Note about package version: because this is a git package, even if the package version appears out of date in the AUR PKGBUILD, the most recent version will still be installed, and if you run yaourt with the "--devel" flag, it will "automagically" update all your AUR git packages to the most recent versions. With git-based PKGBUILDs there is a line (or lines) in the PKGBUILD which checks the git repo for the most recent version, regardless of the version listed in the PKGBUILD. in this case that line is: git describe --tags --long | sed -E 's/([^-]*-g)/r\1/;s/-/./g' That being said, I have gone ahead and updated the package version in the PKGBUILD to the most recent one, since I am already here :-) thank you for using my package, and happy bitcoining!