Package Details: asterisk-cert-opus 13.8.0-9

Git Clone URL: https://aur.archlinux.org/asterisk-cert-opus.git (read-only)
Package Base: asterisk-cert-opus
Description: Asterisk certified with patches for Opus support from https://github.com/seanbright/asterisk-opus
Upstream URL: http://www.asterisk.org
Licenses: GPL
Conflicts: asterisk, asterisk-opus
Provides: asterisk=13.8-cert2
Submitter: syfy323
Maintainer: syfy323 (RubenKelevra)
Last Packager: syfy323
Votes: 0
Popularity: 0.000000
First Submitted: 2016-09-04 13:54
Last Updated: 2016-09-04 15:07

Latest Comments

RubenKelevra commented on 2016-09-12 12:44

[CC] btree/bt_split.c -> btree/bt_split.o
[CC] btree/bt_utils.c -> btree/bt_utils.o
[CC] db/db.c -> db/db.o
[CC] mpool/mpool.c -> mpool/mpool.o
[CC] recno/rec_close.c -> recno/rec_close.o
[CC] recno/rec_delete.c -> recno/rec_delete.o
[CC] recno/rec_get.c -> recno/rec_get.o
[CC] recno/rec_open.c -> recno/rec_open.o
[CC] recno/rec_put.c -> recno/rec_put.o
[CC] recno/rec_search.c -> recno/rec_search.o
[CC] recno/rec_seq.c -> recno/rec_seq.o
[CC] recno/rec_utils.c -> recno/rec_utils.o
[AR] hash/hash.o hash/hash_bigkey.o hash/hash_buf.o hash/hash_func.o hash/hash_log2.o hash/hash_page.o hash/ndbm.o btree/bt_close.o btree/bt_conv.o btree/bt_debug.o btree/bt_delete.o btree/bt_get.o btree/bt_open.o btree/bt_overflow.o btree/bt_page.o btree/bt_put.o btree/bt_search.o btree/bt_seq.o btree/bt_split.o btree/bt_utils.o db/db.o mpool/mpool.o recno/rec_close.o recno/rec_delete.o recno/rec_get.o recno/rec_open.o recno/rec_put.o recno/rec_search.o recno/rec_seq.o recno/rec_utils.o -> libdb1.a
[LD] astdb2sqlite3.o db1-ast/libdb1.a -> astdb2sqlite3
[CC] astdb2bdb.c -> astdb2bdb.o
[LD] astdb2bdb.o db1-ast/libdb1.a -> astdb2bdb
[pjproject] Making dependencies
[pjproject] Compiling libs
[pjproject] Generating symbols
[pjproject] Compiling apps
[pjproject] Compiling python bindings
make[2]: *** [Makefile:118: source/pjsip-apps/src/python/build/_pjsua.so] Error 1
make[1]: *** [Makefile:20: pjproject] Error 2
make: *** [Makefile:398: third-party] Error 2
==> ERROR: A failure occurred in build().
Aborting...
==> ERROR: Makepkg was unable to build asterisk-cert-opus.