Package Details: balena-etcher 2:1.5.116-1

Git Clone URL: https://aur.archlinux.org/balena-etcher.git (read-only, click to copy)
Package Base: balena-etcher
Description: Flash OS images to SD cards & USB drives, safely and easily
Upstream URL: https://balena.io/etcher
Licenses: Apache
Conflicts: etcher, etcher-bin, etcher-git
Submitter: gin078
Maintainer: gin078
Last Packager: gin078
Votes: 226
Popularity: 4.64
First Submitted: 2019-05-13 11:35
Last Updated: 2021-02-03 16:04

Latest Comments

1 2 3 4 5 6 ... Next › Last »

dimon7388 commented on 2021-03-04 16:39

Получил вот такую ошибку: Run npm audit for details. npm notice npm-shrinkwrap.json up to date make: *** [Makefile:89: electron-develop] Ошибка 1

Как решить эту проблему?

Spixmaster commented on 2021-03-03 18:44

I get the same error as SArpnt: make: *** [Makefile:89: electron-develop] Error 1

haibane commented on 2021-02-22 20:17

I've been getting this for months. ==> ERROR: Failure while downloading etcher git repo Aborting...

Any suggestions? I've tried clean builds and recently uninstall/reinstall.

SArpnt commented on 2021-02-16 00:18

@gin078 i found out it's just an issue on my setup, i still don't know what though. i was able to build fine on my laptop.

gin078 commented on 2021-02-15 13:22

@SArpnt are you still having issues building? I was unable to reproduce in a clean build environment.

SArpnt commented on 2021-02-06 23:18

when i try to build 1.5.116 i get:

make: *** [Makefile:89: electron-develop] Error 1

1.5.115 worked fine for me, is there anything i'm doing wrong?

BenTheTechGuy commented on 2020-12-01 02:57

Could you add i686, armv7h, and aarch64 to the arch section? The package can also be built on these architectures.

elhoce commented on 2020-11-04 19:17

After skipping sha256sum checks, package is working. So the issue comes from sha256sum signature provided in PKGBUILD

lpc123 commented on 2020-11-04 19:04

Confirmed failure reported by PongTea. Suspected issue: new electron9 dependency. Even after installing electron9, balena-etcher-electron.sh still fails.

PongTea commented on 2020-11-04 18:57

Building fails with this message:

==> Validating source files with sha256sums...
    etcher ... Skipped
    balena-etcher-electron.sh ... FAILED
    balena-etcher-electron.desktop ... Passed
==> ERROR: One or more files did not pass the validity check!
Failed to build balena-etcher