Package Details: bluez-utils-compat 5.62-1

Git Clone URL: https://aur.archlinux.org/bluez-utils-compat.git (read-only, click to copy)
Package Base: bluez-utils-compat
Description: Development and debugging utilities for the bluetooth protocol stack. Includes deprecated tools.
Upstream URL: http://www.bluez.org/
Keywords: hciconfig hcidump hcitool
Licenses: GPL2
Conflicts: bluez-hcidump, bluez-hcitool, bluez-utils
Provides: bluez-hcidump, bluez-hcitool, bluez-utils=5.62
Submitter: thurstylark
Maintainer: twa022
Last Packager: twa022
Votes: 43
Popularity: 1.83
First Submitted: 2017-03-02 17:34
Last Updated: 2021-10-13 23:34

Required by (48)

Sources (1)

Latest Comments

« First ‹ Previous 1 2 3 4 5 6 7 Next › Last »

quest commented on 2019-06-28 10:46

tools/btpclient.c: In function ‘signal_handler’:

tools/btpclient.c:2834:7: error: ‘SIGINT’ undeclared (first use in this function)

tools/btpclient.c:2835:7: error: ‘SIGTERM’ undeclared (first use in this function)

bruceutut commented on 2019-06-28 08:15

SIGTERM SIGINT cannot be found when building this package with gcc9.

Maybe need to include signal.h can solve this problem.

twa022 commented on 2019-06-28 02:43

If you are having errors building because of the tests you can skip running the check() function in the PKGBUILD: makepkg -s --nocheck

gkun commented on 2019-06-22 10:12

This won't compile for me, failing at the same place of the last comment on may 24th.

a36233 commented on 2019-05-24 10:14

PASS: unit/test-ecc ./test-driver: line 107: 21893 Aborted (core dumped) "$@" > $log_file 2>&1 FAIL: unit/test-avctp ./test-driver: line 107: 21946 Aborted (core dumped) "$@" > $log_file 2>&1 FAIL: unit/test-avrcp ./test-driver: line 107: 21948 Aborted (core dumped) "$@" > $log_file 2>&1 FAIL: unit/test-hog CCLD unit/test-sdp ./test-driver: line 107: 22040 Aborted (core dumped) "$@" > $log_file 2>&1 FAIL: unit/test-sdp PASS: unit/test-gobex-transfer CCLD unit/test-gatt ./test-driver: line 107: 22107 Aborted (core dumped) "$@" > $log_file 2>&1 FAIL: unit/test-gatt ^Cmake[3]: Deleting file 'unit/test-avdtp.log' make[3]: Deleting file 'unit/test-hfp.log' make[3]: [Makefile:8979: unit/test-avdtp.log] Error 130 make[3]: [Makefile:9000: unit/test-hfp.log] Error 130 make[2]: [Makefile:8877: check-TESTS] Interrupt make[1]: [Makefile:9261: check-am] Interrupt make: *** [Makefile:9263: check] Interrupt

Enverex commented on 2019-01-21 11:06

Patroll: That's not an error, you need to install that key.

Patroll commented on 2019-01-15 10:18

problem with verification signature with gpg: bluez-5.50.tar ... FAILED (unknown public key 06CA9F5D1DCF2659)

bruceutut commented on 2019-01-14 02:39

fail to start after readline 8.0
plz trigger a rebuild.

TheAmigo commented on 2018-07-24 16:36

@yaron when it hangs, you can do a ps and grep for ./unit/test-gatt

Killing that process allows the build to continue. Oddly, it told me that the test passed.

Cebtenzzre commented on 2018-07-09 11:21

Maybe this package should provide bluez-hcitool, as they both provide '/usr/bin/hcitool' and '/usr/share/man/man1/hcitool.1.gz'. Or both should provide hcitool.