Package Details: caffe-ssd-cpu ssdv1.0.r0.g4817bf8b-2

Git Clone URL: https://aur.archlinux.org/caffe-ssd-cpu.git (read-only, click to copy)
Package Base: caffe-ssd-cpu
Description: weiliu89's caffe for CPU only
Upstream URL: https://github.com/weiliu89/caffe/tree/ssd
Licenses: BSD
Conflicts: caffe, caffe-cpu, caffe-cpu-git, caffe-dr-git, caffe-git, caffe-mnc-dr-git, caffe-ssd, caffe2, caffe2-cpu, caffe2-cpu-git, caffe2-git
Provides: caffe, caffe-ssd
Submitter: jerry73204
Maintainer: jerry73204
Last Packager: jerry73204
Votes: 0
Popularity: 0.000000
First Submitted: 2018-11-13 09:12
Last Updated: 2018-12-13 16:27

Latest Comments

arch202928 commented on 2020-02-29 07:07

Compile failed with error message, /usr/include/boost/python/detail/wrap_python.hpp:57:11: fatal error: pyconfig.h: No such file or directory

==> Retrieving sources...
  -> Updating caffe-ssd-cpu git repo...
Fetching origin
==> Validating source files with sha256sums...
    caffe-ssd-cpu ... Skipped
==> Removing existing $srcdir/ directory...
==> Extracting sources...
  -> Creating working copy of caffe-ssd-cpu git repo...
Cloning into 'caffe-ssd-cpu'...
done.
Switched to a new branch 'makepkg'
==> Starting prepare()...
==> Starting pkgver()...
==> Sources are ready.
==> Making package: caffe-ssd-cpu ssdv1.0.r0.g4817bf8b-2 (Sat 29 Feb 2020 03:04:35 PM HKT)
==> Checking runtime dependencies...
==> Checking buildtime dependencies...
==> WARNING: Using existing $srcdir/ tree
==> Starting pkgver()...
==> Removing existing $pkgdir/ directory...
==> Starting build()...
  -> Building target 'all'...
PROTOC src/caffe/proto/caffe.proto
CXX src/caffe/common.cpp
CXX src/caffe/layer_factory.cpp
CXX src/caffe/parallel.cpp
CXX src/caffe/solver.cpp
In file included from /usr/include/boost/python/detail/prefix.hpp:13,
                 from /usr/include/boost/python/args.hpp:8,
                 from /usr/include/boost/python.hpp:11,
                 from src/caffe/layer_factory.cpp:4:
/usr/include/boost/python/detail/wrap_python.hpp:57:11: fatal error: pyconfig.h: No such file or directory
   57 | # include <pyconfig.h>
      |           ^~~~~~~~~~~~
compilation terminated.
make: *** [Makefile:577: .build_release/src/caffe/layer_factory.o] Error 1
make: *** Waiting for unfinished jobs....
==> ERROR: A failure occurred in build().
    Aborting...
Error making: caffe-ssd-cpu