Package Details: caja-dropbox 1.26.0-2

Git Clone URL: https://aur.archlinux.org/caja-dropbox.git (read-only, click to copy)
Package Base: caja-dropbox
Description: Dropbox extension for Caja file manager
Upstream URL: https://github.com/mate-desktop/caja-dropbox
Keywords: Caja Dropbox Extensions Mate
Licenses: GPL, custom:CC-BY-ND-3
Groups: caja-extensions
Submitter: lifning
Maintainer: mws.souza
Last Packager: mws.souza
Votes: 35
Popularity: 0.000000
First Submitted: 2012-03-09 23:12
Last Updated: 2021-10-01 00:15

Latest Comments

1 2 3 Next › Last »

mws.souza commented on 2021-10-01 00:23

Thanks @thebombzen! I've listed autoconf-archive as make dependency

thebombzen commented on 2021-09-27 17:18

I tried to install caja-dropbox 1.26.0-1 and the build failed. Autotools said I needed to provided autoconf-archive and I did not have it installed. Running pacman -S autoconf-archive and then rebuilding worked, but this means it should be listed as a make-depends.

mws.souza commented on 2021-08-02 21:04

I sent an update now, with the correct sha sum. The sha sum from my last comment was for the .tar.xz, but the PKGBUILD uses the .tar.gz which is different.

mws.souza commented on 2021-08-02 20:41

the sha sum is wrong it should be 8f2e8a5bafc93d722af2e593cccb6238963fd1c1dcdb1fef421f9b7a96f0c555 but in the PKBBUILD is f76c9effccf7f36650cda9e82ad1c581a4535d7b9da05dd99e767699c46dc311

here the release for v1.25.0 https://github.com/mate-desktop/caja-dropbox/releases/tag/v1.25.0

liamdawe commented on 2021-07-14 12:51

Same error.

guzzisti commented on 2021-07-14 12:41

@liamdawe Would you please try again.

liamdawe commented on 2021-07-14 12:30

Seems it's currently broken?

-> Found caja-dropbox-1.25.0.tar.gz ==> Validating source files with sha256sums... caja-dropbox-1.25.0.tar.gz ... FAILED ==> ERROR: One or more files did not pass the validity check! error downloading sources: caja-dropbox

FabioLolix commented on 2017-08-17 17:58

@koesherbacon

I don't have a mate installation at the moment, but it builds anyway on Cinnamon.

Why are you skipping integrity source check?

==> Download dei sorgenti in corso...
-> Download di caja-dropbox-1.18.0.tar.gz in corso...
% Total % Received % Xferd Average Speed Time Time Time Current
Dload Upload Total Spent Left Speed
100 134 0 134 0 0 227 0 --:--:-- --:--:-- --:--:-- 227
100 104k 0 104k 0 0 64094 0 --:--:-- 0:00:01 --:--:-- 124k
==> Validazione di source file con sha1sums...
caja-dropbox-1.18.0.tar.gz ... Verificato
==> Estrazione dei sorgenti in corso...
-> Estrazione di caja-dropbox-1.18.0.tar.gz usando bsdtar in corso...
==> Avvio di prepare() in corso...
aclocal: warning: couldn't open directory 'm4': No such file or directory
libtoolize: putting auxiliary files in '.'.
libtoolize: copying file './ltmain.sh'
libtoolize: putting macros in AC_CONFIG_MACRO_DIRS, 'm4'.
libtoolize: copying file 'm4/libtool.m4'
libtoolize: copying file 'm4/ltoptions.m4'
libtoolize: copying file 'm4/ltsugar.m4'
libtoolize: copying file 'm4/ltversion.m4'
libtoolize: copying file 'm4/lt~obsolete.m4'
configure.ac:20: installing './compile'
configure.ac:21: installing './config.guess'
configure.ac:21: installing './config.sub'
configure.ac:5: installing './install-sh'
configure.ac:5: installing './missing'
src/Makefile.am: installing './depcomp'

koesherbacon commented on 2017-08-17 14:41

I'm having difficulty installing the current 1.18.0 version due to the error "Failed to create 'm4'." Do you have any suggestions for me? Thanks a lot!

Here'sthe output with the error and the additional proof that m4 is installed correctly. (I apologize in advance if I have not properly formatted this cut'n'paste. I'm not sure how to get [ code ] using this comment box.)

====

-> Downloading caja-dropbox-1.18.0.tar.gz...
% Total % Received % Xferd Average Speed Time Time Time Current
Dload Upload Total Spent Left Speed
100 134 0 134 0 0 134 0 --:--:-- 0:00:01 --:--:-- 82
100 104k 0 104k 0 0 35709 0 --:--:-- 0:00:03 --:--:-- 66457
==> WARNING: Skipping all source file integrity checks.
==> Extracting sources...
-> Extracting caja-dropbox-1.18.0.tar.gz with bsdtar
==> Starting prepare()...
aclocal: warning: couldn't open directory 'm4': No such file or directory
libtoolize: putting auxiliary files in '.'.
libtoolize: copying file './ltmain.sh'
libtoolize: error: Failed to create 'm4'
autoreconf: libtoolize failed with exit status: 1
==> ERROR: A failure occurred in prepare().
Aborting...
==> ERROR: Makepkg was unable to build caja-dropbox.
==> Restart building caja-dropbox ? [y/N]
ev ~ $


m4-1.4.18-1-x86_64 166.1 KiB 117K/s 00:01 [#############################] 100%
(1/1) checking keys in keyring [#############################] 100%
(1/1) checking package integrity [#############################] 100%
(1/1) loading package files [#############################] 100%
(1/1) checking for file conflicts [#############################] 100%
(1/1) checking available disk space [#############################] 100%
:: Processing package changes...
(1/1) reinstalling m4 [#############################] 100%
:: Running post-transaction hooks...
(1/2) Arming ConditionNeedsUpdate...
(2/2) Updating the info directory file...
ev ~ $

josealb77 commented on 2017-01-04 08:37

checking for CAJA... no
configure: error: Package requirements (libcaja-extension >= 1.17.1) were not met:

Requested 'libcaja-extension >= 1.17.1' but version of libcaja-extension is 1.16.1

Consider adjusting the PKG_CONFIG_PATH environment variable if you
installed software in a non-standard prefix.

Alternatively, you may set the environment variables CAJA_CFLAGS
and CAJA_LIBS to avoid the need to call pkg-config.
See the pkg-config man page for more details.
==> ERROR: Se produjo un fallo en build().
Cancelando…
==> ERROR: Makepkg no ha podido compilar caja-dropbox.
==> ¿Reiniciar la compilación de caja-dropbox? [s/N]
==> ------------------------------------------------
==>

There's no libcaja-extension package in Arch neither AUR