Package Details: calculix 2.16-4

Git Clone URL: https://aur.archlinux.org/calculix.git (read-only, click to copy)
Package Base: calculix
Description: CalculiX: 3D finite element solver and post-processor (executables)
Upstream URL: http://www.calculix.de/
Keywords: calculix finite-element
Licenses: GPL2
Submitter: None
Maintainer: mauritiusdadd
Last Packager: mauritiusdadd
Votes: 17
Popularity: 0.000067
First Submitted: 2007-11-24 13:59
Last Updated: 2020-05-23 21:11

Latest Comments

« First ‹ Previous 1 2 3 4 5 6 7 8 Next › Last »

rbn920 commented on 2017-10-30 18:48

Looks like there is a problem with the ccx sha256sums.

mauritiusdadd commented on 2017-06-29 09:26

I've updated the checksums and and bumped the pkgrel.
Thank you for reporting.

rbn920 commented on 2017-06-28 18:18

It looks like the sha256sun for cgx is still wrong.

Thanks

ciappi commented on 2017-05-21 18:01

Hi mauritiusdadd,

it seams that the sha256sum of cgx is wrong...

Thanks a lot
ciappi

Alexa commented on 2016-08-09 17:40

thanks a lot :)

i will rebuild this today ;)

best reg.

Alex

mauritiusdadd commented on 2016-08-08 09:24

It seems that the problem lies upstream (even the newer version 2.11 has the has the same problem). I updated the patch file with a quick and dirty workaround, just until the author of the program fixes the code.

mauritiusdadd commented on 2016-08-06 11:51

Hi Alexa,

thank you for reporing the issue, i will look into this as sson as I can.

Alexa commented on 2016-08-05 14:03

Hi

Thanks for packaging, could you pls take a look into the PKGBUILD... ??

cgx no longer builds with gcc-6.1.1 ...

throws some weird errors ... in fact, neither cgx 2.11 nor cgx 2.10 ....


thread -lrt -o cgx
In file included from /usr/include/c++/6.1.1/bits/char_traits.h:39:0,
from /usr/include/c++/6.1.1/ios:40,
from /usr/include/c++/6.1.1/ostream:38,
from /usr/include/c++/6.1.1/iostream:39,
from uselibSNL.cpp:28:
/usr/include/c++/6.1.1/bits/stl_algobase.h:243:56: error: macro "min" passed 3 arguments, but takes just 2
min(const _Tp& __a, const _Tp& __b, _Compare __comp)
^
/usr/include/c++/6.1.1/bits/stl_algobase.h:265:56: error: macro "max" passed 3 arguments, but takes just 2
max(const _Tp& __a, const _Tp& __b, _Compare __comp)
^
In file included from ../../libSNL/src/snlCurveBase.h:23:0,
from ../../libSNL/src/snlCurve.h:25,
from ../../libSNL/src/snlSurface.h:20,
from uselibSNL.cpp:30:
../../libSNL/src/snlKnotVector.h:115:18: error: macro "max" requires 2 arguments, but only 1 given
knot max() const; // Max knot val.
^
../../libSNL/src/snlKnotVector.h:116:18: error: macro "min" requires 2 arguments, but only 1 given
knot min() const; // Min knot val.
^
^Cmake: *** [Makefile:69: cgx] Interrupt

mauritiusdadd commented on 2016-03-27 18:20

Updated checksums and bumped pkgrel.

mauritiusdadd commented on 2016-03-07 06:00

Updated to version 2.10, thanks.