Package Details: calf-git 0.0.60.r2370.e7daf55-1

Git Clone URL: (read-only)
Package Base: calf-git
Description: LV2/JACK audio plug-ins for musicians (git version)
Upstream URL:
Licenses: GPL, LGPL
Conflicts: calf
Provides: calf
Submitter: hollunder
Maintainer: SpotlightKid
Last Packager: SpotlightKid
Votes: 28
Popularity: 0.525308
First Submitted: 2009-04-06 12:51
Last Updated: 2016-08-16 04:18

Latest Comments

SpotlightKid commented on 2016-08-16 04:18

Updated project URL.

SpotlightKid commented on 2016-08-14 18:29

This was now fixed upstream, so no new package version should be necessary.

SpotlightKid commented on 2016-08-14 15:05

In the meanwhile, here's the patch:

SpotlightKid commented on 2016-08-14 15:01

I created a patch from this PR:

But I can't submit the new version of the package, because I get authentication failures for the Git server. I can't push any package atm. See

skrylar commented on 2016-08-14 05:22

Can get a successful build by putting in forced typecasts to double, patch as follows:

SpotlightKid commented on 2016-08-11 18:43

@habys: Yes, I get that too.

habys commented on 2016-08-11 17:17

Anyone else get:

/usr/include/c++/6.1.1/bits/stl_algobase.h:265:5: note: template argument deduction/substitution failed:
analyzer.cpp:479:85: note: deduced conflicting types for parameter 'const _Tp' ('float' and 'double')
0.6f * fabs(fft_outR[_iter]) - var1R , 1e-20);
make[3]: *** [Makefile:744: analyzer.lo] Error 1
make[3]: Leaving directory '/tmp/yaourt-tmp-luke/aur-calf-git/src/calf/src'
make[2]: *** [Makefile:763: all-recursive] Error 1
make[2]: Leaving directory '/tmp/yaourt-tmp-luke/aur-calf-git/src/calf/src'
make[1]: *** [Makefile:595: all-recursive] Error 1
make[1]: Leaving directory '/tmp/yaourt-tmp-luke/aur-calf-git/src/calf'
make: *** [Makefile:397: all] Error 2
==> ERROR: A failure occurred in build().
==> ERROR: Makepkg was unable to build calf-git.

SpotlightKid commented on 2015-12-31 03:49

The project moved its repository. If you built this package manually with makepkg and have built it before, please remove the 'calf' directory before rebuilding.

asnakeofjune commented on 2014-06-03 21:19

As far as I can see, parametrics of eqs don't work in ardour. Shelfs and Cuts do. Something wrong with libboost?

speps commented on 2012-09-26 14:08

@CedricR @imv thanks you all for reporting last changes in calf development.
Now calf-git 20120926-1 depends on fftw, also disabled debug mode and added sse optimizations. Cheers.

All comments