Package Details: carla-git 1:2.3.0.RC2.r0.g2294a5c86-1

Git Clone URL: https://aur.archlinux.org/carla-git.git (read-only, click to copy)
Package Base: carla-git
Description: Audio Plugin Host
Upstream URL: http://kxstudio.sf.net/carla
Keywords: daw host plugin vst2 vst3
Licenses: GPL2+
Conflicts: carla
Provides: carla
Submitter: cocreature
Maintainer: SpotlightKid (Joermungand)
Last Packager: SpotlightKid
Votes: 23
Popularity: 0.142852
First Submitted: 2013-10-11 12:29
Last Updated: 2021-03-17 22:08

Required by (12)

Sources (1)

Pinned Comments

SpotlightKid commented on 2021-03-17 22:10

Heads up, everybody! I've switched this package back from building the "develop" branch to the "main" branch again, since the "develop" branch is now gone. If you re-use your package build directories, you might have to delete the old "carla" repo directory and you also may need to delete the "src" directory before re-building.

Latest Comments

« First ‹ Previous ... 4 5 6 7 8 9 10 11 Next › Last »

nlehmann commented on 2015-05-19 17:45

I get the following error when trying to compile

In file included from zynaddsubfx-src.cpp:58:0:
zynaddsubfx/DSP/SVFilter.cpp: In member function ‘void SVFilter::singlefilterout(float*, SVFilter::fstage&, SVFilter::parameters&)’:
zynaddsubfx/DSP/SVFilter.cpp:144:70: error: ‘errx’ was not declared in this scope
errx(1, "Impossible SVFilter type encountered [%d]", type);
^
In file included from zynaddsubfx-src.cpp:59:0:
zynaddsubfx/DSP/Unison.cpp: In member function ‘void Unison::updateParameters()’:
zynaddsubfx/DSP/Unison.cpp:112:54: error: ‘warnx’ was not declared in this scope
warnx("BUG: Unison amplitude samples too big");
^
Makefile:300: recipe for target '../../build/native-plugins/Release/zynaddsubfx-src.cpp.o' failed
make[1]: *** [../../build/native-plugins/Release/zynaddsubfx-src.cpp.o] Error 1
make[1]: Leaving directory '/home/nlehmann/AUR/carla-git/src/carla-git/source/native-plugins'
Makefile:102: recipe for target '/home/nlehmann/AUR/carla-git/src/carla-git/build/modules/Release/native-plugins.a' failed
make: *** [/home/nlehmann/AUR/carla-git/src/carla-git/build/modules/Release/native-plugins.a] Error 2

cocreature commented on 2015-04-29 05:36

I updated the package to use git tags. Your aur helper probably won't pick that update up so you need to manually update one time. Sorry for that. Also experimental plugins are now also built.

SpotlightKid commented on 2014-12-03 19:00

(Remove previous version of this comment, where I mistakenly referred to this being the same error as in the comment below.)

There's an error in the top-level Makefile in the repo. I fixed this in my PKGBUILD by adding:

prepare() {
cd "$srcdir/$pkgname"
sed -i -e 's@source/modules/CarlaNative.h@source/includes/CarlaNative.h@' \
Makefile
}

cocreature commented on 2014-12-03 19:00

Sorry for having missed your comment jarch-jarch
This is going to get fixed upstream in the next days. I won't update the package with a workaround as you shouldn't use it right now anyway. That's what you get for wanting to use the git version :D

SpotlightKid commented on 2014-12-03 18:46

Yes, I also get this. There's an error in the top-level Makefile in the repo. I fixed this in my PKGBUILD by adding:

prepare() {
cd "$srcdir/$pkgname"
sed -i -e 's@source/modules/CarlaNative.h@source/includes/CarlaNative.h@' \
Makefile
}

jarch-jarch commented on 2014-11-13 05:06

Getting this error on both 64 and 32 builds:

Makefile:118: recipe for target 'JackBridgeExport.cpp.win32e.o' failed
make[1]: *** [JackBridgeExport.cpp.win32e.o] Error 1
make[1]: Leaving directory '/tmp/yaourt-tmp-j/aur-carla-bridges-win32-git/src/carla-bridges-win32-git/source/modules/jackbridge'
Makefile:99: recipe for target 'source/modules/jackbridge.win32e.a' failed
make: *** [source/modules/jackbridge.win32e.a] Error 2
==> ERROR: A failure occurred in build().
Aborting...
==> ERROR: Makepkg was unable to build carla-bridges-win32-git.

Saw down the comments someone else had something similar but it was a problem with the Carla package or something? Anyone else getting it? Thanks.

cocreature commented on 2014-11-02 17:36

It's not my fault if namcap is wrong.
python-pyqt4 is needed (try removing it, if you don't believe me) and it already has python3 as a dependency so there's no need to specify this again. libmagic is in file and file is in the base-devel group which should always be installed if you want to use the aur and those packages should not be included in the dependencies.

SpotlightKid commented on 2014-11-02 17:18

namcap has the following complaints:

carla-git W: Referenced library 'python3\n#' is an uninstalled dependency
carla-git E: Dependency file detected and not included (libraries ['usr/lib/libmagic.so.1'] needed in files ['usr/lib/vst/carla.vst/CarlaRackFX.so', 'usr/lib/lv2/carla.lv2/carla.so', 'usr/lib/vst/carla.vst/CarlaRack.so', 'usr/lib/carla/libcarla_standalone2.so', 'usr/lib/vst/carla.vst/CarlaPatchbayFX.so', 'usr/lib/vst/carla.vst/CarlaPatchbay.so'])
carla-git W: Dependency included and not needed ('python-pyqt4')

cocreature commented on 2014-07-11 22:00

and updated again.

sekret commented on 2014-07-11 18:54

Confirmed!

Just recognized, your optional dependency zynaddsubfx-g2it doesn't exist. Looks like a typo to me.