Package Details: cataclysm-dda-tiles 0.C.2019.02.13-1

Git Clone URL: https://aur.archlinux.org/cataclysm-dda-tiles.git (read-only)
Package Base: cataclysm-dda-tiles
Description: A post-apocalyptic roguelike,tiles only
Upstream URL: http://en.cataclysmdda.com/
Keywords: game rogue tiles
Licenses: CCPL:by-sa
Conflicts: cataclysm-dda, cataclysm-dda-ncurses, cataclysm-dda-sdl-git
Submitter: yangtsesu
Maintainer: FredBezies
Last Packager: FredBezies
Votes: 3
Popularity: 0.519629
First Submitted: 2017-07-14 08:08
Last Updated: 2019-02-13 19:43

Latest Comments

dangersalad commented on 2019-02-06 22:27

This is currently failing to build for me

src/sounds.cpp: In function ‘void sfx::do_ambient()’:
src/sounds.cpp:610:43: error: this statement may fall through [-Werror=implicit-fallthrough=]
                 play_ambient_variant_sound( "environment", "WEATHER_SNOWSTORM", heard_volume, 20,
                 ~~~~~~~~~~~~~~~~~~~~~~~~~~^~~~~~~~~~~~~~~~~~~~~~~~~~~~~~~~~~~~~~~~~~~~~~~~~~~~~~~
                                             1000 );
                                             ~~~~~~
src/sounds.cpp:612:13: note: here
             case WEATHER_SNOW:
             ^~~~
cc1plus: all warnings being treated as errors
make: *** [Makefile:813: obj/tiles/sounds.o] Error 1
make: *** Waiting for unfinished jobs....

EDIT: Working now after deleting the master.zip file that was downloaded, seems I got it at a bad commit

p177 commented on 2018-12-18 10:36

Thanks, just noticed I only needed to leave out "dda".

FredBezies commented on 2018-12-18 10:34

You can run it from command line.

Sigi commented on 2018-04-10 18:02

It's not working; Will have a look perhaps its easy to fix.

Hunk #1 FAILED at 224. Hunk #2 succeeded at 409 (offset 20 lines). 1 out of 2 hunks FAILED -- saving rejects to file Makefile.rej ==> ERROR: A failure occurred in build(). Aborting...

jackstraw commented on 2018-01-27 05:26

charlie5, I'm also getting that error.

charlie5 commented on 2017-12-08 16:22

Howdy,

Looks like a nice game.

Atm, I am getting ...

==> Starting build()... patching file Makefile Hunk #1 FAILED at 224. Hunk #2 succeeded at 407 (offset 18 lines). 1 out of 2 hunks FAILED -- saving rejects to file Makefile.rej ==> ERROR: A failure occurred in build().

Is that a common prob ?

Cheers.