Package Details: cflint-git 20160522.-1

Git Clone URL: (read-only, click to copy)
Package Base: cflint-git
Description: A static code analysis tool for ColdFusion - dev branch
Upstream URL:
Licenses: BSD
Conflicts: cflint, cflint-ui
Provides: cflint, cflint-ui
Submitter: jphustman
Maintainer: jphustman
Last Packager: jphustman
Votes: 0
Popularity: 0.000000
First Submitted: 2015-04-22 17:03 (UTC)
Last Updated: 2016-05-25 18:03 (UTC)

Dependencies (4)

Required by (0)

Sources (1)

Latest Comments

VLegacy commented on 2022-10-31 16:50 (UTC)

Hey there! This (and fail when I try to install them, with the below.

Do you know if this is an issue with this package, or something I should take upstream?


Results :

Tests in error: 
  TestCFLintChainedConfig.setUp:22 » ExceptionInInitializer
  TestCFLintChainedConfig.setUp:22 » NoClassDefFound Could not initialize class ...
  TestCFLintConfig.test:38 » NoClassDefFound Could not initialize class com.sun....
  TestCFLintConfig2.test:18 » NoClassDefFound Could not initialize class com.sun...

Tests run: 648, Failures: 0, Errors: 4, Skipped: 4

[INFO] ------------------------------------------------------------------------
[INFO] ------------------------------------------------------------------------
[INFO] Total time:  37.269 s
[INFO] Finished at: 2022-10-31T12:14:53-04:00
[INFO] ------------------------------------------------------------------------
[ERROR] Failed to execute goal org.apache.maven.plugins:maven-surefire-plugin:2.18.1:test (default-test) on project CFLint: There are test failures.
[ERROR] Please refer to /home/mmirus/.cache/paru/clone/cflint-git/src/CFLint/target/surefire-reports for the individual test results.
[ERROR] -> [Help 1]
[ERROR] To see the full stack trace of the errors, re-run Maven with the -e switch.
[ERROR] Re-run Maven using the -X switch to enable full debug logging.
[ERROR] For more information about the errors and possible solutions, please read the following articles:
[ERROR] [Help 1]
==> ERROR: A failure occurred in build().
error: failed to build 'cflint-git-20160522.-1': 
error: packages failed to build: cflint-git-20160522.-1