Package Details: chromium-dev 87.0.4252.0-1

Git Clone URL: https://aur.archlinux.org/chromium-dev.git (read-only, click to copy)
Package Base: chromium-dev
Description: The open-source project behind Google Chrome (Dev Channel)
Upstream URL: http://www.chromium.org
Keywords: browser web
Licenses: BSD
Submitter: None
Maintainer: sl1pkn07
Last Packager: sl1pkn07
Votes: 158
Popularity: 0.028434
First Submitted: 2010-05-17 09:04
Last Updated: 2020-09-03 23:23

Dependencies (32)

Required by (1)

Sources (4)

Latest Comments

« First ‹ Previous ... 4 5 6 7 8 9 10 11 12 13 14 ... Next › Last »

sl1pkn07 commented on 2018-05-08 20:14

search FAILED word in your log

SolarAquarion commented on 2018-05-08 20:12

So my compilation error is unique?

sl1pkn07 commented on 2018-05-08 20:12

nope. my issue is with the libevent part

seems native_client_nosfi is never set, and pnacl-clang not have this define

SolarAquarion commented on 2018-05-08 20:09

Is this your issue

[33109/35282] /usr/bin/python2 ../../v8/tools/run.py ./mksnapshot --turbo_instruction_scheduling --embedded_src gen/v8/embedded.cc --embedded_variant Default --random-seed 314159265 --startup_blob snapshot_blob.bin [33110/35282] ../../native_client/toolchain/linux_x86/pnacl_newlib/bin/x86_64-nacl-clang++ -MMD -MF irt_x64/obj/components/tracing/tracing/tracing_messages.o.d -DNACL_TC_REV=b48266b051f596802addff7c8d1fc6fb9cf6bea7 -DTRACING_IMPLEMENTATION -DV8_DEPRECATION_WARNINGS -DNO_TCMALLOC -DFULL_SAFE_BROWSING -DSAFE_BROWSING_CSD -DSAFE_BROWSING_DB_LOCAL -DOFFICIAL_BUILD -DCHROMIUM_BUILD -D_FILE_OFFSET_BITS=64 -D_LARGEFILE_SOURCE -D_LARGEFILE64_SOURCE -DSTDC_CONSTANT_MACROS -DSTDC_FORMAT_MACROS -DNDEBUG -DNVALGRIND -DGOOGLE_PROTOBUF_NO_RTTI -DGOOGLE_PROTOBUF_NO_STATIC_INITIALIZER -DHAVE_PTHREAD -I../.. -Iirt_x64/gen -I../../third_party/protobuf/src -fno-strict-aliasing -fcolor-diagnostics -fmerge-all-constants -integrated-as -fasynchronous-unwind-tables -fomit-frame-pointer -Wall -Wextra -Wimplicit-fallthrough -Wthread-safety -Wno-missing-field-initializers -Wno-unused-parameter -Wno-c++11-narrowing -Wno-covered-switch-default -Wno-unneeded-internal-declaration -Wno-inconsistent-missing-override -Os -ffunction-sections -fdata-sections -fomit-frame-pointer -fvisibility=hidden -std=gnu++14 -fno-exceptions -fno-rtti -fvisibility-inlines-hidden -c ../../components/tracing/common/tracing_messages.cc -o irt_x64/obj/components/tracing/tracing/tracing_messages.o [33111/35282] ../../native_client/toolchain/linux_x86/pnacl_newlib/bin/x86_64-nacl-clang++ -MMD -MF irt_x64/obj/gpu/ipc/common/command_buffer_traits_sources/gpu_command_buffer_traits.o.d -DNACL_TC_REV=b48266b051f596802addff7c8d1fc6fb9cf6bea7 -DV8_DEPRECATION_WARNINGS -DNO_TCMALLOC -DFULL_SAFE_BROWSING -DSAFE_BROWSING_CSD -DSAFE_BROWSING_DB_LOCAL -DOFFICIAL_BUILD -DCHROMIUM_BUILD -D_FILE_OFFSET_BITS=64 -D_LARGEFILE_SOURCE -D_LARGEFILE64_SOURCE -DSTDC_CONSTANT_MACROS -DSTDC_FORMAT_MACROS -DNDEBUG -DNVALGRIND -DGPU_IMPLEMENTATION -DGOOGLE_PROTOBUF_NO_RTTI -DGOOGLE_PROTOBUF_NO_STATIC_INITIALIZER -DHAVE_PTHREAD -I../.. -Iirt_x64/gen -I../../third_party/khronos -I../../gpu -I../../third_party/protobuf/src -fno-strict-aliasing -fcolor-diagnostics -fmerge-all-constants -integrated-as -fasynchronous-unwind-tables -fomit-frame-pointer -Wall -Wextra -Wimplicit-fallthrough -Wthread-safety -Wno-missing-field-initializers -Wno-unused-parameter -Wno-c++11-narrowing -Wno-covered-switch-default -Wno-unneeded-internal-declaration -Wno-inconsistent-missing-override -Os -ffunction-sections -fdata-sections -fomit-frame-pointer -fvisibility=hidden -std=gnu++14 -fno-exceptions -fno-rtti -fvisibility-inlines-hidden -c ../../gpu/ipc/common/gpu_command_buffer_traits.cc -o irt_x64/obj/gpu/ipc/common/command_buffer_traits_sources/gpu_command_buffer_traits.o [33112/35282] ../../native_client/toolchain/linux_x86/pnacl_newlib/bin/x86_64-nacl-clang++ -MMD -MF irt_x64/obj/ipc/ipc/ipc_channel_common.o.d -DNACL_TC_REV=b48266b051f596802addff7c8d1fc6fb9cf6bea7 -DIS_IPC_IMPL -DV8_DEPRECATION_WARNINGS -DNO_TCMALLOC -DFULL_SAFE_BROWSING -DSAFE_BROWSING_CSD -DSAFE_BROWSING_DB_LOCAL -DOFFICIAL_BUILD -DCHROMIUM_BUILD -D_FILE_OFFSET_BITS=64 -D_LARGEFILE_SOURCE -D_LARGEFILE64_SOURCE -DSTDC_CONSTANT_MACROS -DSTDC_FORMAT_MACROS -DNDEBUG -DNVALGRIND -DGOOGLE_PROTOBUF_NO_RTTI -DGOOGLE_PROTOBUF_NO_STATIC_INITIALIZER -DHAVE_PTHREAD -I../.. -Iirt_x64/gen -I../../third_party/protobuf/src -fno-strict-aliasing -fcolor-diagnostics -fmerge-all-constants -integrated-as -fasynchronous-unwind-tables -fomit-frame-pointer -Wall -Wextra -Wimplicit-fallthrough -Wthread-safety -Wno-missing-field-initializers -Wno-unused-parameter -Wno-c++11-narrowing -Wno-covered-switch-default -Wno-unneeded-internal-declaration -Wno-inconsistent-missing-override -Os -ffunction-sections -fdata-sections -fomit-frame-pointer -fvisibility=hidden -std=gnu++14 -fno-exceptions -fno-rtti -fvisibility-inlines-hidden -c ../../ipc/ipc_channel_common.cc -o irt_x64/obj/ipc/ipc/ipc_channel_common.o [33113/35282] ../../native_client/toolchain/linux_x86/pnacl_newlib/bin/x86_64-nacl-clang++ -MMD -MF irt_x64/obj/components/tracing/tracing/child_trace_message_filter.o.d -DNACL_TC_REV=b48266b051f596802addff7c8d1fc6fb9cf6bea7 -DTRACING_IMPLEMENTATION -DV8_DEPRECATION_WARNINGS -DNO_TCMALLOC -DFULL_SAFE_BROWSING -DSAFE_BROWSING_CSD -DSAFE_BROWSING_DB_LOCAL -DOFFICIAL_BUILD -DCHROMIUM_BUILD -D_FILE_OFFSET_BITS=64 -D_LARGEFILE_SOURCE -D_LARGEFILE64_SOURCE -DSTDC_CONSTANT_MACROS -DSTDC_FORMAT_MACROS -DNDEBUG -DNVALGRIND -DGOOGLE_PROTOBUF_NO_RTTI -DGOOGLE_PROTOBUF_NO_STATIC_INITIALIZER -DHAVE_PTHREAD -I../.. -Iirt_x64/gen -I../../third_party/protobuf/src -fno-strict-aliasing -fcolor-diagnostics -fmerge-all-constants -integrated-as -fasynchronous-unwind-tables -fomit-frame-pointer -Wall -Wextra -Wimplicit-fallthrough -Wthread-safety -Wno-missing-field-initializers -Wno-unused-parameter -Wno-c++11-narrowing -Wno-covered-switch-default -Wno-unneeded-internal-declaration -Wno-inconsistent-missing-override -Os -ffunction-sections -fdata-sections -fomit-frame-pointer -fvisibility=hidden -std=gnu++14 -fno-exceptions -fno-rtti -fvisibility-inlines-hidden -c ../../components/tracing/child/child_trace_message_filter.cc -o irt_x64/obj/components/tracing/tracing/child_trace_message_filter.o [33114/35282] ../../native_client/toolchain/linux_x86/pnacl_newlib/bin/x86_64-nacl-clang++ -MMD -MF irt_x64/obj/ipc/mojom/ipc.mojom.o.d -DNACL_TC_REV=b48266b051f596802addff7c8d1fc6fb9cf6bea7 -DIS_IPC_MOJOM_IMPL -DV8_DEPRECATION_WARNINGS -DNO_TCMALLOC -DFULL_SAFE_BROWSING -DSAFE_BROWSING_CSD -DSAFE_BROWSING_DB_LOCAL -DOFFICIAL_BUILD -DCHROMIUM_BUILD -D_FILE_OFFSET_BITS=64 -D_LARGEFILE_SOURCE -D_LARGEFILE64_SOURCE -DSTDC_CONSTANT_MACROS -DSTDC_FORMAT_MACROS -DNDEBUG -DNVALGRIND -I../.. -Iirt_x64/gen -fno-strict-aliasing -fcolor-diagnostics -fmerge-all-constants -integrated-as -fasynchronous-unwind-tables -fomit-frame-pointer -Wall -Wextra -Wimplicit-fallthrough -Wthread-safety -Wno-missing-field-initializers -Wno-unused-parameter -Wno-c++11-narrowing -Wno-covered-switch-default -Wno-unneeded-internal-declaration -Wno-inconsistent-missing-override -Os -ffunction-sections -fdata-sections -fomit-frame-pointer -fvisibility=hidden -std=gnu++14 -fno-exceptions -fno-rtti -fvisibility-inlines-hidden -c irt_x64/gen/ipc/ipc.mojom.cc -o irt_x64/obj/ipc/mojom/ipc.mojom.o

sl1pkn07 commented on 2018-05-08 19:40

oh, is a newer version. now in test

sl1pkn07 commented on 2018-05-08 15:10

https://pastebin.com/gccHmTE6

SolarAquarion commented on 2018-05-08 14:44

/home/solaraquarion/build/chromium-dev/src/chromium-68.0.3418.2/third_party/ffmpeg/libavcodec/libopus.c:22:10: fatal error: 'opus_defines.h' file not found

include <opus_defines.h></opus_defines.h>
     ^~~~~~~~~~~~~~~~

/home/solaraquarion/build/chromium-dev/src/chromium-68.0.3418.2/third_party/ffmpeg/libavcodec/libopusdec.c:22:10: error: 'opus.h' file not found with <angled> include; use "quotes" instead </angled>

include <opus.h></opus.h>
     ^~~~~~~~
     "opus.h"

1 error generated. <br> CC libavcodec/lsp.o make: [/home/solaraquarion/build/chromium-dev/src/chromium-68.0.3418.2/third_party/ffmpeg/ffbuild/common.mak:60: libavcodec/libopus.o] Error 1 make: Waiting for unfinished jobs.... /home/solaraquarion/build/chromium-dev/src/chromium-68.0.3418.2/third_party/ffmpeg/libavcodec/libopusdec.c:23:10: fatal error: 'opus_multistream.h' file not found

include <opus_multistream.h></opus_multistream.h>
     ^~~~~~~~~~~~~~~~~~~~

I'm getting this with the build

sl1pkn07 commented on 2018-05-08 04:22

See #c3 on the bugreport

SolarAquarion commented on 2018-05-08 01:06

But Chromium is at this? 68.0.3409.2

sl1pkn07 commented on 2018-05-06 10:34

stuck in here: https://bugs.chromium.org/p/chromium/issues/detail?id=837441