Package Details: cinepaint 1:1.0.4-7

Git Clone URL: (read-only, click to copy)
Package Base: cinepaint
Description: Sophisticated graphics manipulation programm supporting > 8bit pictures
Upstream URL:
Licenses: GPL, LGPL, MIT
Submitter: City-busz
Maintainer: bidulock
Last Packager: bidulock
Votes: 1
Popularity: 0.000000
First Submitted: 2018-01-28 23:55 (UTC)
Last Updated: 2018-02-06 05:21 (UTC)

Latest Comments

bazza commented on 2022-05-27 15:30 (UTC)

The file doesn't exist anymore:

There's a new version of 2021:

dreieck commented on 2019-03-20 12:54 (UTC)

Fails to build for me:

libtool: link: g++ -shared -nostdlib /usr/lib/gcc/x86_64-pc-linux-gnu/8.2.1/../../../../lib/Scrt1.o /usr/lib/gcc/x86_64-pc-linux-gnu/8.2.1/../../../../lib/crti.o /usr/lib/gcc/x86_64-pc-linux-gnu/8.2.1/crtbeginS.o  .libs/half.o .libs/cinepaint_half.o   -lX11 -L/usr/lib/gcc/x86_64-pc-linux-gnu/8.2.1 -L/usr/lib/gcc/x86_64-pc-linux-gnu/8.2.1/../../../../lib -L/lib/../lib -L/usr/lib/../lib -L/usr/lib/gcc/x86_64-pc-linux-gnu/8.2.1/../../.. -lstdc++ -lm -lc -lgcc_s -lgcc /usr/lib/gcc/x86_64-pc-linux-gnu/8.2.1/crtendS.o /usr/lib/gcc/x86_64-pc-linux-gnu/8.2.1/../../../../lib/crtn.o  -march=native -Wl,-z -Wl,relro -Wl,-z -Wl,now -Wl,-O1 -Wl,-z -Wl,relro -Wl,-z -Wl,now -Wl,--strip-all -Wl,--as-needed -Wl,--relax -Wl,--sort-common -Wl,--hash-style=gnu   -Wl,-soname -Wl, -o .libs/
/sbin/ld: /usr/lib/libc_nonshared.a(elf-init.oS): in function `__libc_csu_init':
(.text+0x18): undefined reference to `__init_array_start'
/sbin/ld: /usr/lib/libc_nonshared.a(elf-init.oS): relocation R_X86_64_PC32 against undefined hidden symbol `__init_array_start' can not be used when making a shared object
/sbin/ld: final link failed: bad value
collect2: error: ld returned 1 exit status
make[2]: *** [Makefile:418:] Error 1
make[2]: Leaving directory '/tmp/yaourt-tmp-felics/aur-cinepaint/src/cinepaint-1.0-4/libhalf'
make[1]: *** [Makefile:352: all] Error 2
make[1]: Leaving directory '/tmp/yaourt-tmp-felics/aur-cinepaint/src/cinepaint-1.0-4/libhalf'
make: *** [Makefile:662: all-recursive] Error 1
==> ERROR: A failure occurred in build().