Package Details: clhep 2.3.1.1-1

Git Clone URL: https://aur.archlinux.org/clhep.git (read-only)
Package Base: clhep
Description: A Class library for High Energy Physics
Upstream URL: http://proj-clhep.web.cern.ch/
Licenses: GPL3
Submitter: mauspacker
Maintainer: donpicoro
Last Packager: donpicoro
Votes: 9
Popularity: 0.000000
First Submitted: 2007-10-17 17:47
Last Updated: 2015-12-09 15:58

Latest Comments

parnmatt commented on 2015-09-22 15:23

Cheers @donpicoro, I can confirm that this now successfully builds, utilising all 8 of my cores.

Thanks for the swift response and fix.

donpicoro commented on 2015-09-22 14:17

Hi, parnmatt

I can't remember why I used the "-j1". I had troubles at some point and I can remember where/when was it. So now it's removed.

The compilation of the documentations seems like it is a no go. I found this
https://www.tug.org/pipermail/tex-live/2015-June/037019.html
which seems like the proper explanation for it.

Cheers and let me know if you have any more comments.

/Pico

parnmatt commented on 2015-09-22 13:28

…Also, is there any particular reason the PKGBUILD has a hard coded -j1 for making, rather than letting our makepkg.conf take care of it?
Does CLHEP have to be compiled on a single core?

parnmatt commented on 2015-09-22 13:17

I'm getting a build error.

Seems to be an issue converting the documentation, dvi --> ps --> pdf

Something seems to be undefined in the file. Output below, any thoughts?

(surprised it's not just using pdflatex directly [or to use latexmk -pdf which is included and compiles the needed amount of times].)

[ 75%] ps2pdf
Error: /undefined in startTexFig
Operand stack:
33811824 30917427 0 0 33811824 30917427
Execution stack:
%interp_exit .runexec2 --nostringval-- --nostringval-- --nostringval-- 2 %stopped_push --nostringval-- --nostringval-- --nostringval-- false 1 %stopped_push 1967 1 3 %oparray_pop 1966 1 3 %oparray_pop 1950 1 3 %oparray_pop 1836 1 3 %oparray_pop --nostringval-- %errorexec_pop .runexec2 --nostringval-- --nostringval-- --nostringval-- 2 %stopped_push --nostringval--
Dictionary stack:
--dict:1191/1684(ro)(G)-- --dict:0/20(G)-- --dict:79/200(L)-- --dict:115/300(L)--
Current allocation mode is local
Last OS error: No such file or directory
Current file position is 339298
GPL Ghostscript 9.16: Unrecoverable error, exit code 1
GenericFunctions/doc/CMakeFiles/GenericFunctionsgenericFunctionsDocument.dir/build.make:60: recipe for target 'GenericFunctions/doc/genericFunctions.pdf' failed
make[2]: *** [GenericFunctions/doc/genericFunctions.pdf] Error 1
make[2]: *** Deleting file 'GenericFunctions/doc/genericFunctions.pdf'
CMakeFiles/Makefile2:1704: recipe for target 'GenericFunctions/doc/CMakeFiles/GenericFunctionsgenericFunctionsDocument.dir/all' failed
make[1]: *** [GenericFunctions/doc/CMakeFiles/GenericFunctionsgenericFunctionsDocument.dir/all] Error 2
Makefile:160: recipe for target 'all' failed
make: *** [all] Error 2
==> ERROR: A failure occurred in build().
Aborting...

donpicoro commented on 2014-08-17 18:30

Updated =D

totsilence commented on 2014-08-16 12:30

CLHEP 2.2.0.2 was released a couple of days ago. :)

lonaowna commented on 2014-05-08 19:05

Thanks for maintaining! :)

donpicoro commented on 2014-05-08 17:38

updated. Thanks !! =D

lonaowna commented on 2014-05-08 12:52

version 2.1.4.1 is available
md5sums=('3e75199be7970fe7260af7aa57c47bdd')

donpicoro commented on 2012-03-04 18:00

the documentation is now in
/usr/share/doc/clhep
instead of
/usr/share/clhep

donpicoro commented on 2012-02-27 21:51

Updated!
in this release now it builds also the documentation and regarding the two previously (fixed) reported bugs:
- binaries in /usr/bin DO NOW have the correct permissions .... :D
- the symlinks for the libraries in /usr/lib are not created .. :(

it was Bye bye to the first one https://savannah.cern.ch/bugs/?91543 :D
but the second one is still there... so partly the quick fix provided by Bastian is there.

donpicoro commented on 2012-02-03 00:28

As pointed by Bastian Beischer the package presented the following problems when building it using cmake.

- binaries in /usr/bin do not have the correct permissions
- the symlinks for the libraries in /usr/lib are not created.

Thanks Bastian for also provide the proper quick fix.

donpicoro commented on 2012-02-01 20:26

It was flagged as outdated and it was orphan, so I decided to give it a go. Now I maintain it and is looking good here ;)

Cheers and happy usage.

Eothred commented on 2010-05-11 15:15

Thanks! Checked 64bit version and things seem to work fine from what I can see :)

mauspacker commented on 2010-04-26 20:15

Updated...

Eothred commented on 2010-04-23 09:56

Please update source version, as my geant4 package depends on version 2.0.4.6 (as of tomorrow). Would be nice if the geant4 package could depend on this clhep package instead of providing it.