Package Details: clockywock 0.3.1a-1

Git Clone URL: https://aur.archlinux.org/clockywock.git (read-only)
Package Base: clockywock
Description: Analog clock, with alarm and color, for command line.
Upstream URL: http://soomka.com/
Licenses: GPL2
Submitter: keenerd
Maintainer: keenerd
Last Packager: keenerd
Votes: 25
Popularity: 0.477273
First Submitted: 2009-05-23 06:25
Last Updated: 2015-06-13 04:10

Dependencies (1)

Required by (0)

Sources (1)

Latest Comments

Sara commented on 2011-10-10 18:19

I can't hear the alarm that I've set, and I have set them correctly. K. Mandla also reported the same issue on his blog post about clockywock. Is there a
dependency for clockywock that is not listed? My sound works perfectly fine on my computer (a Thinkpad X220).

Anonymous comment on 2011-09-15 18:24

THANKS to keenerd the problem solved :D

Anonymous comment on 2011-09-15 18:05

To project manager!!
the source is NOT FOUND!!
there for the project is tosted.
plz specify another source in pkgbuild

keenerd commented on 2011-08-20 09:50

Fixed.

Sara commented on 2011-08-19 23:46

I am no longer able to build this. Are you also getting this error?

g++ -O3 -Wall -o clockywock clockywock.cpp -lncurses -lpthread
clockywock.cpp:69:7: error: redefinition of ‘class timex’
/usr/include/bits/timex.h:24:8: error: previous definition of ‘class timex’
clockywock.cpp:131:14: error: definition of implicitly-declared ‘timex::timex()’
clockywock.cpp:192:15: error: definition of implicitly-declared ‘timex::~timex()’
clockywock.cpp:202:26: error: no ‘void timex::SaveSettings()’ member function declared in class ‘timex’
clockywock.cpp:225:26: error: no ‘void timex::LoadSettings()’ member function declared in class ‘timex’
clockywock.cpp:251:19: error: no ‘void timex::Slide()’ member function declared in class ‘timex’
clockywock.cpp:299:18: error: no ‘void timex::Info()’ member function declared in class ‘timex’
clockywock.cpp:340:25: error: no ‘void timex::RedoWindows()’ member function declared in class ‘timex’
clockywock.cpp:418:23: error: no ‘void timex::PrintFace()’ member function declared in class ‘timex’
clockywock.cpp:438:43: error: no ‘void timex::PrintHour(int, int)’ member function declared in class ‘timex’
clockywock.cpp:461:47: error: no ‘void timex::PrintMinute(int, int)’ member function declared in class ‘timex’
clockywock.cpp:483:52: error: no ‘void timex::PrintSecond(int, int)’ member function declared in class ‘timex’
clockywock.cpp:543:22: error: no ‘void timex::RunClock()’ member function declared in class ‘timex’
clockywock.cpp: In function ‘int main(int, char**)’:
clockywock.cpp:807:9: error: ‘class timex’ has no member named ‘RunClock’
make: *** [all] Error 1

donvla commented on 2010-06-14 08:42

http://soomka.com/clockywock-0.2.3E.tar.gz