Package Details: cloudcompare-git 2.8.0.r140.gedb8d44b-1

Git Clone URL: (read-only)
Package Base: cloudcompare-git
Description: A 3D point cloud (and triangular mesh) processing software
Upstream URL:
Keywords: 3d mesh poincloud scan
Licenses: GPL2
Submitter: dbrgn
Maintainer: bartus
Last Packager: bartus
Votes: 7
Popularity: 0.549312
First Submitted: 2015-08-20 19:52
Last Updated: 2017-05-01 00:20

Latest Comments

bartus commented on 2017-05-01 00:15

@nicolasvila Problem lays in CMake and should be fixed in cmake 3.8 which is currently in testing repo. Temporary add some quick fix to allow you and others to build the package.

nicolasvila commented on 2017-04-30 16:58

There's an error during compilation, or more exactly during configure.
CGALSupport.cmake has a wrong path:

CMake Error at CC/CGALSupport.cmake:15 (include):
include could not find load file:
Call Stack (most recent call first):
CC/CMakeLists.txt:16 (include)

I managed to compile with a small hack but I don't like that:
sudo ln -s /usr /usr/usr

dbrgn commented on 2017-03-09 23:38

To those commenting with fix suggestions, the package is orphaned, so feel free to take over and fix the issues.

bartus commented on 2017-03-09 23:12

'liblas' need to be listed in makedepend also.
Current if system doesn't have 'liblas' installed beforehand you got error complaining about missing 'liblas/point.hpp'.

scummos commented on 2017-02-25 10:45

Why not have it in the AUR, though?

kikislater commented on 2017-02-25 09:31

@jrdnjhntn : thanks for your pkgbuild hosted on github !

heczis commented on 2017-02-04 09:32

I keep getting this event when liblas is installed:

[ 44%] Building CXX object libs/qCC_io/CMakeFiles/QCC_IO_LIB.dir/LASFilter.cpp.o
/home/jan/SOFT/cloudcompare-git/src/trunk/libs/qCC_io/LASFilter.cpp:36:28: fatal error: liblas/point.hpp: No such file or directory
#include <liblas/point.hpp>
compilation terminated.
make[2]: *** [libs/qCC_io/CMakeFiles/QCC_IO_LIB.dir/build.make:467: libs/qCC_io/CMakeFiles/QCC_IO_LIB.dir/LASFilter.cpp.o] Error 1
make[2]: *** Waiting for unfinished jobs....
make[1]: *** [CMakeFiles/Makefile2:356: libs/qCC_io/CMakeFiles/QCC_IO_LIB.dir/all] Error 2
make: *** [Makefile:128: all] Error 2
==> ERROR: A failure occurred in build().

@jrdnjhntn - thanks for your github version, works fine ;-)

scummos commented on 2016-11-04 16:11

needs to depend on doxygen

jrdnjhntn commented on 2016-09-16 15:06

@anyone following this package;

I've updated my pkgbuild and will continue to do so, here;

Idk. if/when I will take over this package in AUR, but for now, if you need cloudcompare - it's on my github. thx

jrdnjhntn commented on 2016-09-12 18:03

@jga - your very welcome and I am glad that you can work with it again!

btw, I noticed your comments on github cloudcompare (I'm watching that branch!).

...I'm still not sure about qGMMREG plugin and the new plugin isn't working last I checked (breaks the build, some plroblem with Qt, but When I get a moment I will report the error / post a log to cloudcompare).

i'll try to keep my github packaging in good working order, taking over this package as maintainer might be slower. (since the aur4 migration, i'm not used to maintaining packages anymore, unfortunately)..

All comments