Package Details: clutter-git 1.24.2.r17.g8c86357-1

Git Clone URL: https://aur.archlinux.org/clutter-git.git (read-only)
Package Base: clutter-git
Description: A GObject based library for creating fast, visually rich graphical user interfaces
Upstream URL: http://clutter-project.org/
Licenses: LGPL
Conflicts: clutter
Provides: clutter=1.24.2.r17.g8c86357
Submitter: None
Maintainer: klusark
Last Packager: klusark
Votes: 24
Popularity: 0.000002
First Submitted: 2009-01-24 08:59
Last Updated: 2015-11-24 20:58

Required by (20)

Sources (1)

Latest Comments

klusark commented on 2015-12-15 02:30

@mnovick1988 , not seeing any issues here

mnovick1988 commented on 2015-12-12 08:32

getting this...
GISCAN Clutter-1.0.gir
./.libs/libclutter-1.0.so: undefined reference to `gdk_device_get_vendor_id'
./.libs/libclutter-1.0.so: undefined reference to `gdk_device_get_product_id'
collect2: error: ld returned 1 exit status

Dea993 commented on 2015-05-31 10:17

add "git" as make dependencies

klusark commented on 2015-02-20 15:41

@Nordlicht: Fixed

Nordlicht commented on 2015-02-20 15:04

Fails to build:

./evdev/clutter-device-manager-evdev.c: In function 'process_device_event':
./evdev/clutter-device-manager-evdev.c:1202:17: error: too few arguments to function 'libinput_event_pointer_get_axis_value'
value = libinput_event_pointer_get_axis_value (axis_event);
^
In file included from ./evdev/clutter-device-manager-evdev.c:40:0:
/usr/include/libinput.h:693:1: note: declared here
libinput_event_pointer_get_axis_value(struct libinput_event_pointer *event,
^
./evdev/clutter-device-manager-evdev.c:1203:9: warning: implicit declaration of function 'libinput_event_pointer_get_axis' [-Wimplicit-function-declaration]
axis = libinput_event_pointer_get_axis (axis_event);
^
Makefile:2384: recipe for target 'clutter-device-manager-evdev.lo' failed
make[2]: *** [clutter-device-manager-evdev.lo] Error 1
make[2]: *** Waiting for unfinished jobs....
make[2]: Leaving directory '/home/nordlicht/AUR/clutter-git/src/clutter/clutter'
Makefile:1852: recipe for target 'all' failed
make[1]: *** [all] Error 2
make[1]: Leaving directory '/home/nordlicht/AUR/clutter-git/src/clutter/clutter'
Makefile:601: recipe for target 'all-recursive' failed
make: *** [all-recursive] Error 1

hundeboll commented on 2014-05-28 17:37

Here's a PKGBUILD that makes mutter-git build:
http://bpaste.net/show/311367/

frank604 commented on 2014-02-05 04:24

Fails to build without having gtk-doc installed from extra. Builds perfectly with.

alesko commented on 2013-12-11 21:24

What is out of date in a git repository?

Anonymous comment on 2011-07-02 18:22

WARNING: Moved to git.gnome.org/clutter

Anonymous comment on 2010-10-25 00:49

gobject-introspection-git needed too, it won't build with gobject-introspection 0.9.10

lubosz commented on 2010-10-07 17:15

json-glib needs to be installed as a dependency.

lubosz commented on 2010-10-07 17:07

After a visit in the IRC channel, the build has been fixed upstream to work with libtool 2.4 :)
Unflaging as out of date.

lubosz commented on 2010-10-07 14:13

The build complains about missing libtool >= 2.2
I have libtool 2.4 from core installed.

simon04 commented on 2010-09-30 09:32

> configure: error: Package requirements (cairo >= 1.8 atk >= 1.7 pangocairo >= 1.20 json-glib-1.0 >= 0.12 gdk-pixbuf-2.0 gl libdrm x11 xext xfixes xdamage xcomposite) were not met:
> No package 'json-glib-1.0' found

Det commented on 2010-09-04 18:25

Flagging until at least the makedependencies line fixed.

Anonymous comment on 2010-06-20 07:52

Also, git should be added to makedepends

Anonymous comment on 2010-06-19 16:09

Adding
makedepends=('gtk-doc')
to the PKGBUILD seems to fix it.

Now it compiles fine, but fails linking with the error:
...
CC test_interactive-test-devices.o
CCLD test-interactive
../../clutter/.libs/libclutter-glx-1.0.so: undefined reference to `JSON_NODE_HOLDS_ARRAY'
collect2: ld returned 1 exit status
make[3]: *** [test-interactive] Fejl 1

Anonymous comment on 2010-06-19 15:39

...
checking for CLUTTER_DEPS... yes
checking for gobject-introspection... no
./configure: line 13526: syntax error near unexpected token `1.13,'
./configure: line 13526: `GTK_DOC_CHECK(1.13, --flavour no-tmpl)'
==> ERROR: Build Failed.
Aborting...
==> ERROR: Makepkg was unable to build clutter-git.

The source doesn't compile atm. Is there a working package somewhere?

Anonymous comment on 2010-03-27 19:34

Initialized empty Git repository in /var/abs/local/yaourtbuild/clutter-git/src/clutter/.git/
fatal: The remote end hung up unexpectedly