Package Details: compiz-ubuntu 1:0.9.12.1.15.10.20150627.1-1

Git Clone URL: https://aur.archlinux.org/compiz-ubuntu.git (read-only)
Package Base: compiz-ubuntu
Description: OpenGL window and compositing manager
Upstream URL: http://www.compiz.org/
Licenses: GPL
Groups: unity
Conflicts: compiz, metacity-ubuntu
Provides: compiz, compiz-core
Submitter: chenxiaolong
Maintainer: None
Last Packager: chenxiaolong
Votes: 12
Popularity: 0.000013
First Submitted: 2012-10-22 18:13
Last Updated: 2015-07-19 19:21

Required by (17)

Sources (7)

Latest Comments

patrakov commented on 2015-12-20 17:48

Fails to build due to new libsigc++. The c++11 error is fixable by editing the line about CXXFLAGS to say:

export CXXFLAGS+=" -lc -std=c++11"

But then it still fails due to bad concersion from GLProgram* to boost::shared_ptr<GLProgram>.

mmk2410 commented on 2015-03-25 17:21

I'm getting this error:

[ 18%] Generating Python Bytecode
Merging translations into ccsm.desktop.
running build
running build_py
creating /tmp/yaourt-tmp-mmk/aur-compiz-ubuntu/src/compiz-0.9.12.1+15.04.20150303/build/compizconfig/ccsm/build
creating /tmp/yaourt-tmp-mmk/aur-compiz-ubuntu/src/compiz-0.9.12.1+15.04.20150303/build/compizconfig/ccsm/build/lib
creating /tmp/yaourt-tmp-mmk/aur-compiz-ubuntu/src/compiz-0.9.12.1+15.04.20150303/build/compizconfig/ccsm/build/lib/ccm
copying ccm/Constants.py -> /tmp/yaourt-tmp-mmk/aur-compiz-ubuntu/src/compiz-0.9.12.1+15.04.20150303/build/compizconfig/ccsm/build/lib/ccm
copying ccm/Widgets.py -> /tmp/yaourt-tmp-mmk/aur-compiz-ubuntu/src/compiz-0.9.12.1+15.04.20150303/build/compizconfig/ccsm/build/lib/ccm
copying ccm/Settings.py -> /tmp/yaourt-tmp-mmk/aur-compiz-ubuntu/src/compiz-0.9.12.1+15.04.20150303/build/compizconfig/ccsm/build/lib/ccm
copying ccm/Utils.py -> /tmp/yaourt-tmp-mmk/aur-compiz-ubuntu/src/compiz-0.9.12.1+15.04.20150303/build/compizconfig/ccsm/build/lib/ccm
copying ccm/Pages.py -> /tmp/yaourt-tmp-mmk/aur-compiz-ubuntu/src/compiz-0.9.12.1+15.04.20150303/build/compizconfig/ccsm/build/lib/ccm
copying ccm/Window.py -> /tmp/yaourt-tmp-mmk/aur-compiz-ubuntu/src/compiz-0.9.12.1+15.04.20150303/build/compizconfig/ccsm/build/lib/ccm
copying ccm/Conflicts.py -> /tmp/yaourt-tmp-mmk/aur-compiz-ubuntu/src/compiz-0.9.12.1+15.04.20150303/build/compizconfig/ccsm/build/lib/ccm
copying ccm/__init__.py -> /tmp/yaourt-tmp-mmk/aur-compiz-ubuntu/src/compiz-0.9.12.1+15.04.20150303/build/compizconfig/ccsm/build/lib/ccm
running build_scripts
creating /tmp/yaourt-tmp-mmk/aur-compiz-ubuntu/src/compiz-0.9.12.1+15.04.20150303/build/compizconfig/ccsm/build/scripts-2.7
copying and adjusting ccsm -> /tmp/yaourt-tmp-mmk/aur-compiz-ubuntu/src/compiz-0.9.12.1+15.04.20150303/build/compizconfig/ccsm/build/scripts-2.7
changing mode of /tmp/yaourt-tmp-mmk/aur-compiz-ubuntu/src/compiz-0.9.12.1+15.04.20150303/build/compizconfig/ccsm/build/scripts-2.7/ccsm from 644 to 755
compizconfig/ccsm/CMakeFiles/ccsm_module.dir/build.make:64: recipe for target 'compizconfig/ccsm/build/lib.linux-unknown-2.7/ccm/Constants.py' failed
make[2]: *** [compizconfig/ccsm/build/lib.linux-unknown-2.7/ccm/Constants.py] Error 1
CMakeFiles/Makefile2:6378: recipe for target 'compizconfig/ccsm/CMakeFiles/ccsm_module.dir/all' failed
make[1]: *** [compizconfig/ccsm/CMakeFiles/ccsm_module.dir/all] Error 2
Makefile:146: recipe for target 'all' failed
make: *** [all] Error 2

chenxiaolong commented on 2013-04-07 17:26

I'm guessing the error is caused by the new GCC 4.8. I don't have a computer right now, so I can't figure out how to fix it yet :(

In the meantime, binary packages are available on my server (built with GCC 4.7): http://cxl.epac.to:8091/job/UFA-2.0-Build-compiz-ubuntu/

Anonymous comment on 2013-04-07 16:41

Hi!

Same here, additional info:

/tmp/yaourt-tmp-hannes/aur-compiz-ubuntu/src/compiz-0.9.9~daily13.03.25/src/window.cpp: In function 'bool isPendingRestack(compiz::X11::PendingEvent::Ptr)':
/tmp/yaourt-tmp-hannes/aur-compiz-ubuntu/src/compiz-0.9.9~daily13.03.25/src/window.cpp:3026:50: error: 'shared_static_cast' is not a member of 'boost'
compiz::X11::PendingConfigureEvent::Ptr pc = boost::shared_static_cast <compiz::X11::PendingConfigureEvent> (p);
^
/tmp/yaourt-tmp-hannes/aur-compiz-ubuntu/src/compiz-0.9.9~daily13.03.25/src/window.cpp:3026:111: error: expected primary-expression before '>' token
compiz::X11::PendingConfigureEvent::Ptr pc = boost::shared_static_cast <compiz::X11::PendingConfigureEvent> (p);
^
/tmp/yaourt-tmp-hannes/aur-compiz-ubuntu/src/compiz-0.9.9~daily13.03.25/src/window.cpp: In function 'bool isExistingRequest(compiz::X11::PendingEvent::Ptr, XWindowChanges&, unsigned int)':
/tmp/yaourt-tmp-hannes/aur-compiz-ubuntu/src/compiz-0.9.9~daily13.03.25/src/window.cpp:3033:50: error: 'shared_static_cast' is not a member of 'boost'
compiz::X11::PendingConfigureEvent::Ptr pc = boost::shared_static_cast <compiz::X11::PendingConfigureEvent> (p);
^
/tmp/yaourt-tmp-hannes/aur-compiz-ubuntu/src/compiz-0.9.9~daily13.03.25/src/window.cpp:3033:111: error: expected primary-expression before '>' token
compiz::X11::PendingConfigureEvent::Ptr pc = boost::shared_static_cast <compiz::X11::PendingConfigureEvent> (p);
^
/tmp/yaourt-tmp-hannes/aur-compiz-ubuntu/src/compiz-0.9.9~daily13.03.25/src/window.cpp: In member function 'int PrivateWindow::addWindowStackChanges(XWindowChanges*, CompWindow*, const ServerLock&)':
/tmp/yaourt-tmp-hannes/aur-compiz-ubuntu/src/compiz-0.9.9~daily13.03.25/src/window.cpp:4165:8: error: 'shared_static_cast' is not a member of 'boost'
boost::shared_static_cast<compiz::X11::PendingEvent> (compiz::X11::PendingConfigureEvent::Ptr (
^
/tmp/yaourt-tmp-hannes/aur-compiz-ubuntu/src/compiz-0.9.9~daily13.03.25/src/window.cpp:4165:59: error: expected primary-expression before '>' token
boost::shared_static_cast<compiz::X11::PendingEvent> (compiz::X11::PendingConfigureEvent::Ptr (
^
At global scope:
cc1plus: warning: unrecognized command line option "-Wno-unused-private-field" [enabled by default]
cc1plus: warning: unrecognized command line option "-Wno-unused-private-field" [enabled by default]
cc1plus: warning: unrecognized command line option "-Wno-unused-private-field" [enabled by default]
make[2]: *** [src/CMakeFiles/compiz_core.dir/window.cpp.o] Error 1
make[1]: *** [src/CMakeFiles/compiz_core.dir/all] Error 2
make: *** [all] Error 2

Anonymous comment on 2013-04-02 13:25

error: expected primary-expression before ‘>’ token
At global scope:
cc1plus: warning: unrecognized command line option "-Wno-unused-private-field" [enabled by default]
cc1plus: warning: unrecognized command line option "-Wno-unused-private-field" [enabled by default]
cc1plus: warning: unrecognized command line option "-Wno-unused-private-field" [enabled by default]
make[2]: *** [src/CMakeFiles/compiz_core.dir/window.cpp.o] Error 1
make[1]: *** [src/CMakeFiles/compiz_core.dir/all] Error 2
make: *** [all] Error 2
==> ERROR: A failure occurred in build().
Aborting...

BertVoegele commented on 2012-11-09 10:32

Awesome, this is the first compiz package which is both : quite recent and working "out-of-the-PKGBUILD".