Package Details: compiz 0.9.14.2-6

Git Clone URL: https://aur.archlinux.org/compiz.git (read-only, click to copy)
Package Base: compiz
Description: Composite manager for Aiglx and Xgl, with plugins and CCSM
Upstream URL: https://launchpad.net/compiz
Keywords: ccsm
Licenses: MIT, GPL-2.0-or-later, LGPL-2.1-or-later
Conflicts: ccsm, compiz-bcop, compiz-core, compiz-fusion-plugins-experimental, compiz-fusion-plugins-extra, compiz-fusion-plugins-main, compiz-gtk, compizconfig-python, libcompizconfig, simple-ccsm
Provides: ccsm, compiz-bcop, compiz-core, compiz-plugins-extra, compiz-plugins-main, compizconfig-python, libcompizconfig
Submitter: None
Maintainer: xiota
Last Packager: xiota
Votes: 165
Popularity: 0.38
First Submitted: 2014-08-04 13:22 (UTC)
Last Updated: 2024-05-18 16:06 (UTC)

Required by (27)

Sources (10)

Pinned Comments

<deleted-account> commented on 2018-09-14 14:00 (UTC)

When library names like libprotobuf.so.XX change you just need to rebuild compiz. It's not a problem with the PKGBUILD. This is normal for AUR packages. Packages in the official repos also get rebuilt when libraries are updated.

Note that you shouldn't symlink new library names to old. This will create problems for you further down the line.

Latest Comments

1 2 3 4 5 6 .. 54 Next › Last »

xiota commented on 2024-05-18 16:25 (UTC) (edited on 2024-05-18 16:27 (UTC) by xiota)

@kanehekili Library errors indicate that you need to rebuild. Manjaro recently pushed some significant updates. If you already rebuilt recently (within the last day), there's nothing I can do to help you. This package is working as expected on vanilla Arch.

kanehekili commented on 2024-05-18 15:09 (UTC)

@xiota as I said: compiled compiz in a chroot environment, and it worked until the last update. Been using this package for a long time... It looks like the libstdc++.so.6 doesn't seem to provide some function calls.

xiota commented on 2024-05-17 23:29 (UTC) (edited on 2024-05-17 23:30 (UTC) by xiota)

@kanehekili "Distro is Manjaro..." – This may be the problem. I checked package on Arch and it doesn't have that problem.

Are you building yourself or using a prebuilt package from elsewhere? If using a prebuilt package, the problem is most likely that the build environment doesn't match Manjaro.

kanehekili commented on 2024-05-17 23:10 (UTC) (edited on 2024-05-17 23:12 (UTC) by kanehekili)

Building it in chroot compiz does not start:

compiz: /usr/lib/libstdc++.so.6: version `CXXABI_1.3.15' not found (required by /usr/lib/libcompiz_core.so.ABI-20180221) Distro is Manjaro... Anyone has an idea?

geoffk commented on 2024-03-30 19:50 (UTC)

The 3-24 update completely fixes the issues with Compiz and fusion-icon. So now it's back to working perfectly.

geoffk commented on 2024-03-24 17:26 (UTC)

This worked perfectly with KDE6 and Xorg as of 2024-3-15. But something in the last Arch update has broken it. fusion-icon doesn(t start at all. compiz --replace will work, but major plugins like the cube and wobbly windows are disabled.

Please have a look at this. Thanks!!

xiota commented on 2024-02-07 05:59 (UTC)

@kinoru Looks like a problem with Python 3.12. Arch is still on 3.11. Should be resolved by installing python-setuptools. I'll review this package and add it with any other needed updates, since it will eventually be needed when Arch upgrades Python. But I don't see setuptools available for 3.12 yet, so you're on your own figuring out how to provide it.

kinoru commented on 2024-02-07 04:54 (UTC) (edited on 2024-02-07 04:54 (UTC) by kinoru)

I'm having an issue installing:

[ 21%] Generating build/lib.linux-unknown-3.12/compizconfig.cpython-312-x86_64-linux-gnu.so
Traceback (most recent call last):
  File "/home/user/.cache/yay/compiz/src/compiz-0.9.14.2/compizconfig/compizconfig-python/setup.py", line 2, in <module>
    from distutils.core import setup, Command
ModuleNotFoundError: No module named 'distutils'
make[2]: *** [compizconfig/compizconfig-python/CMakeFiles/compizconfig_python_module.dir/build.make:75: compizconfig/compizconfig-python/build/lib.linux-unknown-3.12/compizconfig.cpython-312-x86_64-linux-gnu.so] Error 1
make[1]: *** [CMakeFiles/Makefile2:7686: compizconfig/compizconfig-python/CMakeFiles/compizconfig_python_module.dir/all] Error 2
make: *** [Makefile:166: all] Error 2
==> ERROR: A failure occurred in build().
    Aborting...
 -> error making: compiz-exit status 4
 -> Failed to install the following packages. Manual intervention is required:
compiz - exit status 4

shoryuken commented on 2023-09-08 20:59 (UTC)

@xiota Ah yes it's building now in a clean chroot. I should have checked, sorry :)

xiota commented on 2023-09-08 20:02 (UTC)

@shoryuken I am unable to replicate. Try clearing cache and building in a clean chroot.