Package Details: coreutils-git 8.28.r32.ga4eedb251-1

Git Clone URL: https://aur.archlinux.org/coreutils-git.git (read-only, click to copy)
Package Base: coreutils-git
Description: Basic file, shell and text manipulation utilities of the GNU operating system
Upstream URL: https://www.gnu.org/software/coreutils/coreutils.html
Licenses: GPL3
Conflicts: coreutils
Provides: coreutils
Submitter: Chocobo1
Maintainer: Chocobo1
Last Packager: Chocobo1
Votes: 3
Popularity: 0.000000
First Submitted: 2017-08-13 18:23 (UTC)
Last Updated: 2017-11-13 15:36 (UTC)

Required by (1428)

Sources (1)

Latest Comments

carlosnewmusic commented on 2021-10-13 09:40 (UTC)

error downloading dependency sources https://pastebin.com/RKEe29f3

shoober420 commented on 2021-01-19 06:58 (UTC)

--skip-po bootstrap flag might be required to build for some people

Chocobo1 commented on 2017-11-13 15:35 (UTC) (edited on 2017-11-13 15:38 (UTC) by Chocobo1)

> It can't build. test-getlogin is marked as "SKIP" here, but now I fail at "test-vc-list-files-git.sh" test. Why bother with the tests when upstream CI fails [1] & official arch package is also skipping checks [2]? I'll just comment out the `make check` cmd. [1]: https://hydra.nixos.org/jobset/gnu/coreutils-master [2]: https://git.archlinux.org/svntogit/packages.git/tree/trunk/PKGBUILD?h=packages/coreutils#n46

timofonic commented on 2017-11-13 14:40 (UTC)

It can't build. Here is the mentioned testsuite.log https://nopaste.linux-dev.org/?1165357 Is it a upstream or package error? I reported to both. PASS: test-getloadavg ../build-aux/test-driver: line 107: 27012 Aborted (core dumped) "$@" > $log_file 2>&1 FAIL: test-getlogin PASS: test-getndelim2 PASS: test-getopt-gnu PASS: test-getopt-posix PASS: test-getprogname PASS: test-gettimeofday PASS: test-hash PASS: test-i-ring PASS: test-iconv-h PASS: test-iconv PASS: test-ignore-value PASS: test-inet_ntop PASS: test-inet_pton PASS: test-ino-map PASS: test-intprops PASS: test-inttostr PASS: test-inttypes PASS: test-ioctl PASS: test-isatty PASS: test-isblank PASS: test-isnand-nolibm PASS: test-isnanf-nolibm PASS: test-isnanl-nolibm PASS: test-iswblank PASS: test-langinfo PASS: test-lchown PASS: test-limits-h PASS: test-link PASS: test-linkat PASS: test-listen PASS: test-locale PASS: test-localeconv PASS: test-localename PASS: test-rwlock1 PASS: test-lock PASS: test-lseek.sh PASS: test-lstat PASS: test-malloc-gnu PASS: test-malloca PASS: test-math SKIP: test-mbrtowc1.sh SKIP: test-mbrtowc2.sh SKIP: test-mbrtowc3.sh SKIP: test-mbrtowc4.sh PASS: test-mbrtowc5.sh SKIP: test-mbrtowc-w32-1.sh SKIP: test-mbrtowc-w32-2.sh SKIP: test-mbrtowc-w32-3.sh SKIP: test-mbrtowc-w32-4.sh SKIP: test-mbrtowc-w32-5.sh PASS: test-mbsalign SKIP: test-mbscasecmp.sh SKIP: test-mbschr.sh SKIP: test-mbsinit.sh SKIP: test-mbsrtowcs1.sh SKIP: test-mbsrtowcs2.sh SKIP: test-mbsrtowcs3.sh SKIP: test-mbsrtowcs4.sh PASS: test-mbsstr1 SKIP: test-mbsstr2.sh SKIP: test-mbsstr3.sh PASS: test-memcasecmp PASS: test-memchr PASS: test-memchr2 PASS: test-memcoll PASS: test-memrchr PASS: test-mkdir PASS: test-mkfifo PASS: test-mknod PASS: test-nanosleep PASS: test-netdb PASS: test-netinet_in PASS: test-nl_langinfo.sh PASS: test-nstrftime PASS: test-open PASS: test-openat-safer PASS: test-openat PASS: test-parse-datetime PASS: test-pathmax PASS: test-perror.sh PASS: test-perror2 PASS: test-pipe PASS: test-pipe2 PASS: test-posixtm PASS: test-printf-frexp PASS: test-printf-frexpl PASS: test-priv-set PASS: test-pthread_sigmask1 PASS: test-pthread_sigmask2 PASS: test-quotearg-simple PASS: test-raise PASS: test-rand-isaac PASS: test-read-file PASS: test-read PASS: test-readlink PASS: test-readlinkat PASS: test-readtokens.sh PASS: test-realloc-gnu PASS: test-regex PASS: test-remove PASS: test-rename PASS: test-renameat PASS: test-renameat2 PASS: test-rmdir PASS: test-sched PASS: test-select PASS: test-select-in.sh PASS: test-select-out.sh PASS: test-setenv SKIP: test-setlocale1.sh PASS: test-setlocale2.sh PASS: test-setsockopt PASS: test-sigaction PASS: test-signal-h PASS: test-signbit PASS: test-sigprocmask PASS: test-sleep PASS: test-snprintf PASS: test-sockets PASS: test-stat PASS: test-stat-time PASS: test-statat PASS: test-stdalign PASS: test-stdbool PASS: test-stddef PASS: test-stdint PASS: test-stdio PASS: test-stdlib PASS: test-strerror PASS: test-strerror_r PASS: test-striconv PASS: test-string PASS: test-strncat PASS: test-strnlen PASS: test-strsignal PASS: test-strtod PASS: test-strtoimax PASS: test-strtoll PASS: test-strtoull PASS: test-strtoumax PASS: test-symlink PASS: test-symlinkat PASS: test-sys_ioctl PASS: test-sys_resource PASS: test-sys_select PASS: test-sys_socket PASS: test-sys_stat PASS: test-sys_time PASS: test-sys_types PASS: test-sys_uio PASS: test-sys_utsname PASS: test-sys_wait PASS: test-termios PASS: test-init.sh PASS: test-thread_self PASS: test-thread_create PASS: test-time PASS: test-timespec PASS: test-tls PASS: test-u64 PASS: test-uname PASS: test-dup-safer PASS: test-unistd PASS: test-u8-mbtoucr PASS: test-u8-uctomb PASS: test-uc_width PASS: uniwidth/test-uc_width2.sh PASS: test-unlink PASS: test-unlinkat PASS: test-unsetenv PASS: test-update-copyright.sh PASS: test-userspec PASS: test-usleep PASS: test-utime-h PASS: test-utime PASS: test-utimens PASS: test-utimensat PASS: test-vasnprintf PASS: test-vasprintf-posix PASS: test-vasprintf PASS: test-vc-list-files-git.sh PASS: test-vc-list-files-cvs.sh PASS: test-verify PASS: test-verify.sh PASS: test-version-etc.sh PASS: test-vfprintf-posix.sh PASS: test-vprintf-posix.sh PASS: test-wchar PASS: test-wcrtomb.sh SKIP: test-wcrtomb-w32-1.sh SKIP: test-wcrtomb-w32-2.sh SKIP: test-wcrtomb-w32-3.sh SKIP: test-wcrtomb-w32-4.sh SKIP: test-wcrtomb-w32-5.sh PASS: test-wctype-h PASS: test-wcwidth PASS: test-write PASS: test-xalloc-die.sh PASS: test-xprintf-posix.sh PASS: test-xstrtoimax.sh PASS: test-xstrtol.sh PASS: test-xstrtoumax.sh PASS: test-xvasprintf PASS: test-yesno.sh ============================================================== GNU coreutils 8.28.32-a4eed: gnulib-tests/test-suite.log ============================================================== # TOTAL: 322 # PASS: 295 # SKIP: 26 # XFAIL: 0 # FAIL: 1 # XPASS: 0 # ERROR: 0 .. contents:: :depth: 2 SKIP: test-btowc1.sh ==================== Skipping test: no traditional french locale is installed SKIP test-btowc1.sh (exit status: 77) SKIP: test-btowc2.sh ==================== Skipping test: no french Unicode locale is installed SKIP test-btowc2.sh (exit status: 77) FAIL: test-getlogin =================== test-getlogin.h:79: assertion 'pwd->pw_uid == stat_buf.st_uid' failed FAIL test-getlogin (exit status: 134) SKIP: test-mbrtowc1.sh ====================== Skipping test: no traditional french locale is installed SKIP test-mbrtowc1.sh (exit status: 77) SKIP: test-mbrtowc2.sh ====================== Skipping test: no french Unicode locale is installed SKIP test-mbrtowc2.sh (exit status: 77) SKIP: test-mbrtowc3.sh ====================== Skipping test: no traditional japanese locale is installed SKIP test-mbrtowc3.sh (exit status: 77) SKIP: test-mbrtowc4.sh ====================== Skipping test: no transitional chinese locale is installed SKIP test-mbrtowc4.sh (exit status: 77) SKIP: test-mbrtowc-w32-1.sh =========================== Skipping test: not a native Windows system SKIP test-mbrtowc-w32-1.sh (exit status: 77) SKIP: test-mbrtowc-w32-2.sh =========================== Skipping test: not a native Windows system SKIP test-mbrtowc-w32-2.sh (exit status: 77) SKIP: test-mbrtowc-w32-3.sh =========================== Skipping test: not a native Windows system SKIP test-mbrtowc-w32-3.sh (exit status: 77) SKIP: test-mbrtowc-w32-4.sh =========================== Skipping test: not a native Windows system SKIP test-mbrtowc-w32-4.sh (exit status: 77) SKIP: test-mbrtowc-w32-5.sh =========================== Skipping test: not a native Windows system SKIP test-mbrtowc-w32-5.sh (exit status: 77) SKIP: test-mbscasecmp.sh ======================== Skipping test: no turkish Unicode locale is installed SKIP test-mbscasecmp.sh (exit status: 77) SKIP: test-mbschr.sh ==================== Skipping test: no chinese GB18030 locale is installed SKIP test-mbschr.sh (exit status: 77) SKIP: test-mbsinit.sh ===================== Skipping test: no french Unicode locale is installed SKIP test-mbsinit.sh (exit status: 77) SKIP: test-mbsrtowcs1.sh ======================== Skipping test: no traditional french locale is installed SKIP test-mbsrtowcs1.sh (exit status: 77) SKIP: test-mbsrtowcs2.sh ======================== Skipping test: no french Unicode locale is installed SKIP test-mbsrtowcs2.sh (exit status: 77) SKIP: test-mbsrtowcs3.sh ======================== Skipping test: no traditional japanese locale is installed SKIP test-mbsrtowcs3.sh (exit status: 77) SKIP: test-mbsrtowcs4.sh ======================== Skipping test: no transitional chinese locale is installed SKIP test-mbsrtowcs4.sh (exit status: 77) SKIP: test-mbsstr2.sh ===================== Skipping test: no french Unicode locale is installed SKIP test-mbsstr2.sh (exit status: 77) SKIP: test-mbsstr3.sh ===================== Skipping test: no chinese GB18030 locale is installed SKIP test-mbsstr3.sh (exit status: 77) SKIP: test-setlocale1.sh ======================== Skipping test: no locale for testing is installed SKIP test-setlocale1.sh (exit status: 77) SKIP: test-wcrtomb-w32-1.sh =========================== Skipping test: not a native Windows system SKIP test-wcrtomb-w32-1.sh (exit status: 77) SKIP: test-wcrtomb-w32-2.sh =========================== Skipping test: not a native Windows system SKIP test-wcrtomb-w32-2.sh (exit status: 77) SKIP: test-wcrtomb-w32-3.sh =========================== Skipping test: not a native Windows system SKIP test-wcrtomb-w32-3.sh (exit status: 77) SKIP: test-wcrtomb-w32-4.sh =========================== Skipping test: not a native Windows system SKIP test-wcrtomb-w32-4.sh (exit status: 77) SKIP: test-wcrtomb-w32-5.sh =========================== Skipping test: not a native Windows system SKIP test-wcrtomb-w32-5.sh (exit status: 77) ============================================================================ Testsuite summary for GNU coreutils 8.28.32-a4eed ============================================================================ # TOTAL: 322 # PASS: 295 # SKIP: 26 # XFAIL: 0 # FAIL: 1 # XPASS: 0 # ERROR: 0 ============================================================================ See gnulib-tests/test-suite.log Please report to bug-coreutils@gnu.org ============================================================================ make[6]: *** [Makefile:6004: test-suite.log] Error 1 make[6]: Leaving directory '/home/timofonic/.cache/pacaur/coreutils-git/src/core utils/gnulib-tests' make[5]: *** [Makefile:6112: check-TESTS] Error 2 make[5]: Leaving directory '/home/timofonic/.cache/pacaur/coreutils-git/src/core utils/gnulib-tests' make[4]: *** [Makefile:8455: check-am] Error 2 make[4]: Leaving directory '/home/timofonic/.cache/pacaur/coreutils-git/src/core utils/gnulib-tests' make[3]: *** [Makefile:5896: check-recursive] Error 1 make[3]: Leaving directory '/home/timofonic/.cache/pacaur/coreutils-git/src/core utils/gnulib-tests' make[2]: *** [Makefile:8457: check] Error 2 make[2]: Leaving directory '/home/timofonic/.cache/pacaur/coreutils-git/src/coreutils/gnulib-tests' make[1]: *** [Makefile:11721: check-recursive] Error 1 make[1]: Leaving directory '/home/timofonic/.cache/pacaur/coreutils-git/src/coreutils' make: *** [Makefile:12198: check] Error 2 ==> ERROR: A failure occurred in check(). Aborting... :: failed to build coreutils-git package(s)