Package Details: coreutils-progress-git 8.24.21.ga4b6405-1

Git Clone URL: https://aur.archlinux.org/coreutils-progress-git.git (read-only)
Package Base: coreutils-progress-git
Description: The basic file, shell and text manipulation utilities of the GNU operating system. Patched for an added progress bar for cp
Upstream URL: http://www.gnu.org/software/coreutils
Licenses: GPL3
Groups: base
Conflicts: coreutils
Provides: coreutils
Submitter: KoffeinFlummi
Maintainer: KoffeinFlummi
Last Packager: KoffeinFlummi
Votes: 0
Popularity: 0.000000
First Submitted: 2015-08-09 18:32
Last Updated: 2015-09-04 19:39

Required by (430)

Sources (4)

Latest Comments

timofonic commented on 2017-11-13 03:16

Error here too...

[timofonic@timolaptop fwupd]$ pacaur --noconfirm --noedit --devel --rebuild -S coreutils-progress-git
:: Package coreutils-progress-git not found in repositories, trying AUR...
:: resolving dependencies...
:: looking for inter-conflicts...

AUR Packages (1) coreutils-progress-git-latest

:: Proceed with installation? [Y/n]
:: Retrieving package(s)...
Cloning into 'coreutils-progress-git'...
remote: Counting objects: 9, done.
remote: Compressing objects: 100% (7/7), done.
remote: Total 9 (delta 1), reused 9 (delta 1)
Unpacking objects: 100% (9/9), done.
sudo: a password is required
[sudo] password for timofonic:
:: Checking coreutils-progress-git integrity...
==> Making package: coreutils-progress-git 8.24.21.ga4b6405-1 (Mon Nov 13 03:47:19 CET 2017)
==> Retrieving sources...
-> Cloning coreutils git repo...
Cloning into bare repository '/home/timofonic/.cache/pacaur/coreutils-progress-git/coreutils'...
remote: Counting objects: 171443, done.
remote: Compressing objects: 100% (40170/40170), done.
remote: Total 171443 (delta 130955), reused 171399 (delta 130928)
Receiving objects: 100% (171443/171443), 32.01 MiB | 1.99 MiB/s, done.
Resolving deltas: 100% (130955/130955), done.
-> Found 0001-copy-Add-a-progress-option.patch
-> Found 0002-copy-fix-missing-progress-check.patch
-> Found 0003-copy-fix-two-potential-divs-by-zero.patch
==> Validating source files with sha256sums...
coreutils ... Skipped
0001-copy-Add-a-progress-option.patch ... Passed
0002-copy-fix-missing-progress-check.patch ... Passed
0003-copy-fix-two-potential-divs-by-zero.patch ... Passed
:: Preparing coreutils-progress-git...
==> Making package: coreutils-progress-git 8.24.21.ga4b6405-1 (Mon Nov 13 03:47:46 CET 2017)
==> WARNING: Skipping dependency checks.
==> Retrieving sources...
-> Updating coreutils git repo...
Fetching origin
-> Found 0001-copy-Add-a-progress-option.patch
-> Found 0002-copy-fix-missing-progress-check.patch
-> Found 0003-copy-fix-two-potential-divs-by-zero.patch
==> WARNING: Skipping all source file integrity checks.
==> Extracting sources...
-> Creating working copy of coreutils git repo...
Cloning into 'coreutils'...
done.
==> Starting prepare()...
-> Applying 0001-copy-Add-a-progress-option.patch
patching file src/copy.c
Hunk #2 succeeded at 208 (offset 12 lines).
Hunk #3 succeeded at 293 (offset 12 lines).
Hunk #4 succeeded at 342 (offset 2 lines).
Hunk #5 succeeded at 404 (offset 3 lines).
Hunk #6 succeeded at 474 (offset -1 lines).
Hunk #7 FAILED at 594.
Hunk #8 succeeded at 1102 (offset 16 lines).
Hunk #9 succeeded at 1368 (offset 12 lines).
Hunk #10 succeeded at 1385 (offset 12 lines).
Hunk #11 succeeded at 2729 (offset 27 lines).
1 out of 11 hunks FAILED -- saving rejects to file src/copy.c.rej
patching file src/copy.h
Hunk #1 succeeded at 241 (offset 3 lines).
patching file src/cp.c
Hunk #1 succeeded at 142 (offset 1 line).
Hunk #2 succeeded at 229 (offset 1 line).
Hunk #3 succeeded at 822 (offset 10 lines).
Hunk #4 succeeded at 953 with fuzz 2 (offset 6 lines).
Hunk #5 succeeded at 1108 (offset 7 lines).
==> ERROR: A failure occurred in prepare().
Aborting...
:: failed to verify integrity or prepare coreutils-progress-git package
[

Alad commented on 2016-04-09 17:09

Doesn't work for me either. Was this patch proposed upstream anyway?

-> Applying 0001-copy-Add-a-progress-option.patch
patching file src/copy.c
Hunk #4 succeeded at 330 (offset -10 lines).
Hunk #5 succeeded at 392 (offset -9 lines).
Hunk #6 succeeded at 466 (offset -9 lines).
Hunk #7 FAILED at 594.
Hunk #8 succeeded at 1095 (offset 9 lines).
Hunk #9 succeeded at 1361 (offset 5 lines).
Hunk #10 succeeded at 1378 (offset 5 lines).
Hunk #11 succeeded at 2712 (offset 10 lines).
1 out of 11 hunks FAILED -- saving rejects to file src/copy.c.rej
patching file src/copy.h
patching file src/cp.c
==> ERROR: A failure occurred in prepare().
Aborting...

EndlessEden commented on 2016-01-08 06:45

wont build, hunk #7 fails to patch.

--- src/copy.c
+++ src/copy.c
@@ -594,7 +681,7 @@ extent_copy (int src_fd, int dest_fd, char *buf, size_t buf_size,
if ( ! sparse_copy (src_fd, dest_fd, buf, buf_size,
sparse_mode == SPARSE_ALWAYS ? hole_size: 0,
true, src_name, dst_name, ext_len, &n_read,
- &wrote_hole_at_eof))
+ &wrote_hole_at_eof, progress))
goto fail;

dest_pos = ext_start + n_read;