Package Details: csync2 2.0-1

Git Clone URL: https://aur.archlinux.org/csync2.git (read-only)
Package Base: csync2
Description: Asynchronous cluster syncronisation tool based on librsync and inspired by Unison
Upstream URL: http://oss.linbit.com/csync2/
Licenses: GPL
Submitter: None
Maintainer: ghostlovescore
Last Packager: ghostlovescore
Votes: 8
Popularity: 0.005828
First Submitted: 2006-06-03 14:48
Last Updated: 2015-07-05 09:57

Latest Comments

RubenKelevra commented on 2015-03-01 17:31

make[1]: Verzeichnis „/tmp/yaourt-tmp-ruben/aur-csync2/src/csync2-1.34“ wird verlassen
make install-am
make[1]: Verzeichnis „/tmp/yaourt-tmp-ruben/aur-csync2/src/csync2-1.34“ wird betreten
make[2]: Verzeichnis „/tmp/yaourt-tmp-ruben/aur-csync2/src/csync2-1.34“ wird betreten
/bin/sh ./mkinstalldirs /tmp/yaourt-tmp-ruben/aur-csync2/pkg/csync2/etc
/usr/bin/mkdir -p '/tmp/yaourt-tmp-ruben/aur-csync2/pkg/csync2/usr/bin'
/usr/bin/mkdir -p '/tmp/yaourt-tmp-ruben/aur-csync2/pkg/csync2/usr/share/man/man1'
/usr/bin/mkdir: das Verzeichnis „/tmp/yaourt-tmp-ruben/aur-csync2/pkg“ kann nicht angelegt werden: Keine Berechtigung
Makefile:479: die Regel für Ziel „install-sbinSCRIPTS“ scheiterte
make[2]: *** [install-sbinSCRIPTS] Fehler 1
make[2]: *** Es wird auf noch nicht beendete Prozesse gewartet...
/usr/bin/mkdir: das Verzeichnis „/tmp/yaourt-tmp-ruben/aur-csync2/pkg“ kann nicht angelegt werden: Keine Berechtigung
mkdir -p -- /tmp/yaourt-tmp-ruben/aur-csync2/pkg/csync2/etc
Makefile:557: die Regel für Ziel „install-man1“ scheiterte
make[2]: *** [install-man1] Fehler 1
mkdir: das Verzeichnis „/tmp/yaourt-tmp-ruben/aur-csync2/pkg“ kann nicht angelegt werden: Keine Berechtigung
Makefile:965: die Regel für Ziel „install-data-local“ scheiterte
make[2]: *** [install-data-local] Fehler 1
make[2]: Verzeichnis „/tmp/yaourt-tmp-ruben/aur-csync2/src/csync2-1.34“ wird verlassen
Makefile:837: die Regel für Ziel „install-am“ scheiterte
make[1]: *** [install-am] Fehler 2
make[1]: Verzeichnis „/tmp/yaourt-tmp-ruben/aur-csync2/src/csync2-1.34“ wird verlassen
Makefile:831: die Regel für Ziel „install“ scheiterte
make: *** [install] Fehler 2
==> FEHLER: Ein Fehler geschah in build().
Breche ab...
==> FEHLER:Makepkg konnte csync2 nicht erstellen.
==> Erstellen von csync2 neu starten?[j/N]
==> --------------------------------------

RubenKelevra commented on 2015-03-01 17:29

==> Mit dem Erstellen von csync2 fortfahren?[J/n]
==> ---------------------------------------------
==>
==> Erstelle und installiere Paket
==> FEHLER: Funktion package() fehlt in /tmp/yaourt-tmp-ruben/aur-csync2/./PKGBUILD
==> FEHLER:Makepkg konnte csync2 nicht erstellen.
==> Erstellen von csync2 neu starten?[j/N]
==> --------------------------------------

Le_3K commented on 2014-03-28 22:14

I have installed all the dependencies, but pacman (nor yaourt) will not install it. I just can't press Enter to confirm the installation. Any idea ?
Thanks a lot !

ghostlovescore commented on 2013-06-08 10:18

Bump. Package updated.

ghostlovescore commented on 2013-06-05 15:51

I will update package ASAP.

minus commented on 2013-06-04 10:53

The migration to /usr/bin has broken this even more.

minus commented on 2013-05-25 17:04

Needs an additional s/AM_CONFIG_HEADER/AC_CONFIG_HEADERS on configure.ac in order to compile.

Francois_B commented on 2012-05-10 19:32

Added. Thank you for your comment.

mtorromeo commented on 2012-05-10 17:10

Please update the pkgbuild by adding x86_64 to arch anche etc/csync2.cfg to backup like this: http://pastie.org/3890576
Thanks.