Package Details: cutemarked 0.11.3-1

Git Clone URL: https://aur.archlinux.org/cutemarked.git (read-only)
Package Base: cutemarked
Description: Qt Markdown Editor
Upstream URL: https://github.com/cloose/CuteMarkEd
Licenses: GPL2
Submitter: drevilt
Maintainer: Esspy
Last Packager: Esspy
Votes: 29
Popularity: 0.046211
First Submitted: 2013-09-29 19:36
Last Updated: 2016-12-06 14:23

Latest Comments

« First ‹ Previous 1 2 3 Next › Last »

Aetf commented on 2015-02-01 07:43

Hi, drevilt

The possible make failure on first run is caused by parallel make.
See this: https://github.com/cloose/CuteMarkEd/pull/201

For the current release version, it can be fixed in prepare:

prepare() {
cd $srcdir/$_realname-$pkgver
sed -i -e "s,#include <discount/mkdio.h>,#include <mkdio.h>,g" app-static/converter/discountmarkdownconverter.cpp
echo "CONFIG += ordered" >> CuteMarkEd.pro
}

drevilt commented on 2014-09-10 11:56

I just tested it and i can compile it without problems.

store88 commented on 2014-09-07 12:49

https://github.com/cloose/CuteMarkEd/issues/165

Can't compile, is anyone successed?

fluxboxer commented on 2014-01-30 13:45

Thanks.

drevilt commented on 2014-01-30 13:03

you need to update discount to 2.1.7

fluxboxer commented on 2014-01-29 19:53

converter/discountmarkdownconverter.cpp:23:28: fatal error: discount/mkdio.h: No such file or directory
#include <discount/mkdio.h>
^
compilation terminated.
Makefile:981: recipe for target 'discountmarkdownconverter.o' failed
make[1]: *** [discountmarkdownconverter.o] Error 1
make[1]: Leaving directory '/tmp/yaourt-tmp-root/aur-cutemarked/src/CuteMarkEd-0.9.0/app-static'
Makefile:143: recipe for target 'sub-app-static-make_first' failed
make: *** [sub-app-static-make_first] Error 2

FOR THE FULL OUTPUT: http://hastebin.com/raw/dijusuxafu

fluxboxer commented on 2013-11-07 11:03

Solved, thank you. Sorry for the late response.

drevilt commented on 2013-11-05 20:49

562: make[1]: /usr/lib/qt/bin/lrelease: Command not found

I have added qt5-tools as makedepends. try it now. it should at least get past that error.

fluxboxer commented on 2013-11-05 18:21

http://hastebin.com/hemidapiri.coffee

drevilt commented on 2013-11-04 23:10

i dont get this error. does it say anything more ? can you post the full log in a pastebin ?