Package Details: cxxtools 2.2.1-1

Git Clone URL: https://aur.archlinux.org/cxxtools.git (read-only)
Package Base: cxxtools
Description: A collection of general-purpose C++ classes
Upstream URL: http://www.tntnet.org/cxxtools.html
Licenses: LGPL
Submitter: None
Maintainer: jarondl
Last Packager: jarondl
Votes: 17
Popularity: 0.000001
First Submitted: 2008-02-01 11:23
Last Updated: 2015-07-04 09:07

Latest Comments

darkstar999 commented on 2014-02-03 00:05

I didn't edit anything and of cause base-devel is installed. And out of HDD space it can´t be. Have anyone an idea how I can fix this problem or find the real problem?

darkstar999 commented on 2014-02-03 00:03

I didn't edit anything and of cause base-devel is installed. Have anyone an idea how I can fix this problem or find the real problem?

haawda commented on 2014-02-02 19:25

Builds fine here. darkstar999, do you have some unusual "-j" settings in your makepkg.conf (MAKEFLAGS)?

jarondl commented on 2014-02-02 19:03

Hi @darkstar999,
The package builds successfully on my machine. I even started a new clean VM with an up-to-date arch installation, and it builds there too. Are you sure you have base-devel installed?
Also, your two errors are in different source files. Maybe you just ran out of space or memory? Anyway, this does not seem like a packaging problem.

darkstar999 commented on 2014-02-01 20:26

On my Server with a Arch installation from December last year. It will not run, it break with the ERROR from my last post! And yet i become this ERROR:

Makefile:736: recipe for target 'iostream.lo' failed
make[2]: *** [iostream.lo] Error 1
make[2]: Leaving directory '/tmp/cxxtools/src/cxxtools-2.2.1/src'
Makefile:476: recipe for target 'all' failed
make[1]: *** [all] Error 2
make[1]: Leaving directory '/tmp/cxxtools/src/cxxtools-2.2.1/src'
Makefile:469: recipe for target 'all-recursive' failed
make: *** [all-recursive] Error 1
==> FEHLER: Ein Fehler geschah in build().
Breche ab ...

bernd_b commented on 2014-02-01 16:52

Today's cxxtools 2.2-1 PKGBUILD compiled here without problems.

darkstar999 commented on 2014-02-01 14:41

Hi I have a problem with this cxxtools version. The installation of cxxtolls exit with this message:


Please submit a full bug report,
with preprocessed source if appropriate.
See <https://bugs.archlinux.org/> for instructions.
Makefile:736: recipe for target 'directoryimpl.lo' failed
make[2]: *** [directoryimpl.lo] Error 1
make[2]: Leaving directory '/tmp/yaourt-tmp-darkstar999/aur-cxxtools/src/cxxtools-2.2/src'
Makefile:476: recipe for target 'all' failed
make[1]: *** [all] Error 2
make[1]: Leaving directory '/tmp/yaourt-tmp-darkstar999/aur-cxxtools/src/cxxtools-2.2/src'
Makefile:468: recipe for target 'all-recursive' failed
make: *** [all-recursive] Error 1
==> FEHLER: Ein Fehler geschah in build().
Breche ab ...
==> ERROR: Makepkg was unable to build cxxtools.


And the needed package gcc-libs is installed.

darkstar999 commented on 2014-02-01 14:40

Hi I have a problem with this cxxtools version. The installation of cxxtolls exit with this message:
[code]
Please submit a full bug report,
with preprocessed source if appropriate.
See <https://bugs.archlinux.org/> for instructions.
Makefile:736: recipe for target 'directoryimpl.lo' failed
make[2]: *** [directoryimpl.lo] Error 1
make[2]: Leaving directory '/tmp/yaourt-tmp-darkstar999/aur-cxxtools/src/cxxtools-2.2/src'
Makefile:476: recipe for target 'all' failed
make[1]: *** [all] Error 2
make[1]: Leaving directory '/tmp/yaourt-tmp-darkstar999/aur-cxxtools/src/cxxtools-2.2/src'
Makefile:468: recipe for target 'all-recursive' failed
make: *** [all-recursive] Error 1
==> FEHLER: Ein Fehler geschah in build().
Breche ab ...
==> ERROR: Makepkg was unable to build cxxtools.
[/code]

And the needed package gcc-libs is installed.

saviour commented on 2012-06-29 16:59

I'm very sorry that I didn't update this pkg for so long. I will orphan this one (+tntnet) because I have not the right time at the moment.

Franek commented on 2012-06-29 11:16

Modified PKGBUILD for version 2.1.1:
https://gist.github.com/3017396

Franek commented on 2012-02-23 12:38

I modified the PKGBUILD for the latest* beta (2.1rc3): https://gist.github.com/1892649

* http://article.gmane.org/gmane.comp.web.server.tntnet/562