Package Details: darktable-git release.2.5.0.r220.g19407a592-1

Git Clone URL: (read-only)
Package Base: darktable-git
Description: A virtual lighttable and darkroom for photographers
Upstream URL:
Licenses: GPL3
Conflicts: darktable
Provides: darktable
Submitter: marco44
Maintainer: marco44
Last Packager: marco44
Votes: 16
Popularity: 0.132472
First Submitted: 2015-08-09 17:40
Last Updated: 2019-01-07 09:22

Latest Comments

« First ‹ Previous 1 2 3 4 Next › Last »

Meltea commented on 2018-05-09 23:18 meh, that's all I could have been bothered to do. edit: and it has been merged.

marco44 commented on 2018-05-09 15:05

Hi Rinoceros. It appeared with GCC 8.1. Either you directly do a bugreport to the darktable team as you found it before me, or I can do it, as you want :)

Rhinoceros commented on 2018-05-08 23:34

I'm getting an error with makepkg:

Scanning dependencies of target soften
[ 77%] Building C object src/iop/CMakeFiles/tonecurve.dir/introspection_tonecurve.c.o
[ 77%] Building C object src/iop/CMakeFiles/soften.dir/introspection_soften.c.o
In file included from /tmp/darktable-git/src/darktable/src/iop/,
                 from /tmp/darktable-git/src/darktable/build/src/iop/
/tmp/darktable-git/src/darktable/src/bauhaus/bauhaus.h:37:32: error: unnecessary parentheses in declaration of ‘dt_bh_get_type’ [-Werror=parentheses]
 #define DT_BAUHAUS_WIDGET_TYPE (dt_bh_get_type())
/tmp/darktable-git/src/darktable/src/bauhaus/bauhaus.h:45:14: note: in expansion of macro ‘DT_BAUHAUS_WIDGET_TYPE’
[ 78%] Linking C shared module
cc1plus: all warnings being treated as errors
make[2]: *** [src/iop/CMakeFiles/tonemap.dir/build.make:68: src/iop/CMakeFiles/tonemap.dir/] Error 1
make[1]: *** [CMakeFiles/Makefile2:5177: src/iop/CMakeFiles/tonemap.dir/all] Error 2
make[1]: *** Waiting for unfinished jobs....
[ 78%] Built target soften
[ 78%] Linking C shared module
[ 78%] Built target tonecurve
[ 78%] Linking CXX shared module
[ 78%] Built target demosaic
make: *** [Makefile:152: all] Error 2
==> ERROR: A failure occurred in build().

marco44 commented on 2018-02-10 18:22

Removed -DUSE_GNOME_KEYRING=Off. It must have been useful once upon a time, I don't know. I'm using KDE, so please tell me if that's ok for gnome.

trougnouf commented on 2018-02-10 16:20

This appears to be built without gnome-keyring (-DUSE_GNOME_KEYRING=Off ) but it requires gnome-keyring.

@micdt this is a git version so it's always the latest when you reinstall it.

micdt commented on 2017-12-15 19:50

There is a new version: Will it be in AUR soon?

marco44 commented on 2017-12-08 16:57

That's weird, I don't have the problem on my machine…

hpd commented on 2017-12-08 10:05

This is currently affected by

holos commented on 2016-09-25 06:03

hi, the clean/reset in pkgver() is troublesome, it clobbers anything done in prepare() if one were to add things there (sometimes I add patches this way)

also the {make,opt,}depends seem out of date/wrong. for instance, lua52 is missing completely. some of the others look misplaced

marco44 commented on 2016-06-23 13:19

aperez: it should be solved with the new version I just uploaded.