Package Details: dateutils 0.4.0-1

Git Clone URL: https://aur.archlinux.org/dateutils.git (read-only)
Package Base: dateutils
Description: nifty utilities and library for fast date-time calculations and conversion (strptime, dadd, dconv, ddiff, dgrep, dround, dseq, dtest)
Upstream URL: http://hroptatyr.github.com/dateutils/
Licenses: BSD
Submitter: philomath
Maintainer: hav3lock
Last Packager: hav3lock
Votes: 13
Popularity: 0.006197
First Submitted: 2012-05-02 14:57
Last Updated: 2016-10-19 04:30

Latest Comments

hav3lock commented on 2016-10-13 14:14

Sorry that I haven't gotten around to updating this yet, I'll try to remember to do it in the next couple of days.

hav3lock commented on 2016-10-06 15:42

v0.4.0 is out and I will be updating the PKGBUILD within the next week or so.

hav3lock commented on 2016-02-07 03:23

Soz yall, I've been so busy with life that I haven't been keeping up with emails lately.

dmp1ce commented on 2016-01-30 14:00

The new upstream version works. Here is the new checksum: 59e47ffe041be6beb2cd8950198e4fa2

hroptatyr commented on 2016-01-22 11:24

Done, v0.3.5 is out.

doctorcolossus commented on 2016-01-22 06:00

Thanks. :)

hroptatyr commented on 2016-01-22 05:10

@doctorcolossus This is entirely my fault. It's a test that takes the current date into consideration, while it worked in 2015, it's no longer working now.

The fix is already upstream, I see if I can roll a new release.

doctorcolossus commented on 2016-01-22 00:00

FAIL: dconv.126.clit
...
==============================================================
1 of 771 tests failed
See test/test-suite.log
Please report to https://github.com/hroptatyr/dateutils/issues
==============================================================
Makefile:949: recipe for target 'test-suite.log' failed
make[4]: *** [test-suite.log] Error 1
make[4]: Leaving directory 'dateutils/src/dateutils-0.3.4/test'
Makefile:1027: recipe for target 'check-TESTS' failed
make[3]: *** [check-TESTS] Error 2
make[3]: Leaving directory 'dateutils/src/dateutils-0.3.4/test'
Makefile:1157: recipe for target 'check-am' failed
make[2]: *** [check-am] Error 2
make[2]: Leaving directory 'dateutils/src/dateutils-0.3.4/test'
Makefile:1160: recipe for target 'check' failed
make[1]: *** [check] Error 2
make[1]: Leaving directory 'dateutils/src/dateutils-0.3.4/test'
make[1]: Entering directory 'dateutils/src/dateutils-0.3.4'
GEN version.mk
make[2]: Entering directory 'dateutils/src/dateutils-0.3.4/build-aux'
make[2]: Nothing to be done for 'check-am'.
make[2]: Leaving directory 'dateutils/src/dateutils-0.3.4/build-aux'
make[1]: Nothing to be done for 'check-am'.
make[1]: Leaving directory 'dateutils/src/dateutils-0.3.4'
Makefile:392: recipe for target 'check-recursive' failed
make: *** [check-recursive] Error 1
make: Target 'check' not remade because of errors.
==> ERROR: A failure occurred in check().
Aborting...
==> ERROR: Makepkg was unable to build dateutils.

hroptatyr commented on 2015-02-13 07:27

@d0lphchrist: fixed in afa39a56
Problem was that GNU date output dates in your locale
which for obvious reasons cannot simply be compared to
dconv/dseq output; they will always act as though
LC_ALL/LANG/TZ was set to C/C/UTC.

New release is coming soon.

d0lphchrist commented on 2015-02-12 20:18

@hav3lock: That's weird, I've written an email with the logs to @hroptatyr. Maybe he finds out what the problem is. Your updated version which skips the tests builds now correctly. Thanks for the effort and black magic ;3

All comments