Package Details: digikam-git r33669.e8ac756-1

Git Clone URL: https://aur.archlinux.org/digikam-git.git (read-only)
Package Base: digikam-git
Description: Digital photo management application for KDE
Upstream URL: http://www.digikam.org/
Licenses: GPL
Groups: digikamsc-git
Conflicts: digikam
Provides: digikam
Submitter: flamelab
Maintainer: Sevenseven
Last Packager: Sevenseven
Votes: 19
Popularity: 0.075655
First Submitted: 2011-02-06 10:54
Last Updated: 2015-12-25 17:43

Latest Comments

venatux commented on 2016-05-04 11:02

To enable opencv 3, please add
-DENABLE_OPENCV3:BOOL=ON
to cmake.

SanskritFritz commented on 2016-03-11 11:38

This is a git package, no versions here. Just compile it, and it will give you the latest version from git.

lexikon commented on 2016-03-11 11:08

its stable release? can you update to 5.0.0-beta3?

zaks commented on 2015-12-20 19:19

compile error:

[ 8%] Building CXX object libs/dimg/CMakeFiles/dimg_src.dir/filters/greycstoration/greycstorationfilter.cpp.o
c++: interner Compiler-Fehler: Getötet (Programm cc1plus)
Bitte senden Sie einen vollständigen Fehlerbericht auf Englisch ein;
inclusive vorverarbeitetem Quellcode, wenn es dienlich ist.
Siehe <https://bugs.archlinux.org/> für nähere Anweisungen.
libs/dimg/CMakeFiles/dimg_src.dir/build.make:2294: die Regel für Ziel „libs/dimg/CMakeFiles/dimg_src.dir/filters/greycstoration/greycstorationfilter.cpp.o“ scheiterte
make[2]: *** [libs/dimg/CMakeFiles/dimg_src.dir/filters/greycstoration/greycstorationfilter.cpp.o] Fehler 4
make[2]: *** Datei „libs/dimg/CMakeFiles/dimg_src.dir/filters/greycstoration/greycstorationfilter.cpp.o“ wird gelöscht
CMakeFiles/Makefile2:654: die Regel für Ziel „libs/dimg/CMakeFiles/dimg_src.dir/all“ scheiterte
make[1]: *** [libs/dimg/CMakeFiles/dimg_src.dir/all] Fehler 2
Makefile:127: die Regel für Ziel „all“ scheiterte
make: *** [all] Fehler 2
==> FEHLER: Ein Fehler geschah in build().
Breche ab...

arojas commented on 2015-10-16 10:29

Merged in master

sl1pkn07 commented on 2015-06-07 10:53

why? only need reinstall the pakage

FadeMind commented on 2015-06-07 10:00

Please upgrade version to: 5.0.0.r32078.047dc1f

ior commented on 2015-03-15 18:47

Thank you, it works.

sl1pkn07 commented on 2015-03-15 15:13

sinply reinstall the package with yaourt or makepkg (or your favorite helper)

ior commented on 2015-03-15 15:10

I have install
libkipi-frameworks-git r1101.26a6552-1
https://aur.archlinux.org/packages/libkipi-frameworks-git/

Where I can find new version?

sl1pkn07 commented on 2015-03-15 10:30

Sounds your libkipi is out of date. Please update it

Greetings

ior commented on 2015-03-15 00:43

Compile error:
[ 16%] Building CXX object utilities/kipiiface/CMakeFiles/kipiiface.dir/kipiinterface.cpp.o
/tmp/yaourt-tmp-user/aur-digikam-frameworks-git/src/digikam/utilities/kipiiface/kipiinterface.cpp: In constructor ‘Digikam::KipiInterface::KipiInterface(QObject*, const QString&)’:
/tmp/yaourt-tmp-user/aur-digikam-frameworks-git/src/digikam/utilities/kipiiface/kipiinterface.cpp:85:22: error: no matching function for call to ‘KIPI::Interface::Interface(QObject* const&, const QString&)’
d(new Private())
^
/tmp/yaourt-tmp-user/aur-digikam-frameworks-git/src/digikam/utilities/kipiiface/kipiinterface.cpp:85:22: note: candidate is:
In file included from /usr/include/KF5/KIPI/KIPI/Interface:1:0,
from /tmp/yaourt-tmp-user/aur-digikam-frameworks-git/src/digikam/utilities/kipiiface/kipiinterface.h:39,
from /tmp/yaourt-tmp-user/aur-digikam-frameworks-git/src/digikam/utilities/kipiiface/kipiinterface.cpp:26:
/usr/include/KF5/KIPI/kipi/interface.h:159:14: note: KIPI::Interface::Interface(QObject*, const char*)
explicit Interface(QObject* const parent, const char* name=0);
^
/usr/include/KF5/KIPI/kipi/interface.h:159:14: note: no known conversion for argument 2 from ‘const QString’ to ‘const char*’
utilities/kipiiface/CMakeFiles/kipiiface.dir/build.make:123: set di istruzioni per l'obiettivo "utilities/kipiiface/CMakeFiles/kipiiface.dir/kipiinterface.cpp.o" non riuscito
make[2]: *** [utilities/kipiiface/CMakeFiles/kipiiface.dir/kipiinterface.cpp.o] Errore 1
CMakeFiles/Makefile2:3533: set di istruzioni per l'obiettivo "utilities/kipiiface/CMakeFiles/kipiiface.dir/all" non riuscito
make[1]: *** [utilities/kipiiface/CMakeFiles/kipiiface.dir/all] Errore 2
Makefile:117: set di istruzioni per l'obiettivo "all" non riuscito
make: *** [all] Errore 2


blackhole commented on 2015-03-10 13:04

New problem:

-- checking for module 'lensfun'
-- found lensfun, version 0.3.0.0
-- Found LensFun: /usr/include/lensfun (found version "0.3.0.0")
-- liblensfun: Found version 0.3.0.0 (required: 0.2.6.0)

sl1pkn07 commented on 2015-03-08 00:44

yep. need fix in upstream

tajidinabd commented on 2015-03-08 00:29

CMake Error at CMakeLists.txt:313 (MACRO_BOOL_TO_01):
Unknown CMake command "MACRO_BOOL_TO_01".


-- Configuring incomplete, errors occurred!
See also "/tmp/yaourt-tmp-tajidinabd/aur-digikam-frameworks-git/src/build/CMakeFiles/CMakeOutput.log".
==> ERROR: A failure occurred in build().



any idea how to fix this macro error

sl1pkn07 commented on 2015-02-01 19:43

see the bugreport comments

greetings

tajidinabd commented on 2015-02-01 19:16

I get a build error right now in regards to the lensfuncameraselector reported upstream @ https://bugs.kde.org/show_bug.cgi?id=343662

Any ideas what is the problem here?

blackhole commented on 2015-01-15 15:40

Now is fine! Thank you

sl1pkn07 commented on 2015-01-15 14:51

@blackhole

try now

greetings

blackhole commented on 2015-01-15 11:08

But this package now is useless for the majority of users since qt5-multimedia is depending on gstreamer 0.10.

I guess that disabling video in the compilation could fix this (personally I don't need it)
Do you know how to change the PKGBUILD?

sl1pkn07 commented on 2015-01-14 23:24

sorry. i can't help with this. my system is gstreamer/vlc free (I have a own build qt5-webkit/qt5-multimedia without gstreamer)

you can follow the bug progress in https://bugs.kde.org/show_bug.cgi?id=342607 like @anex has said

greetings

blackhole commented on 2015-01-14 22:55

I have a lot of errors about GStreamer. My system is fully updated and I have phonon VLC as backend.

-----------------
(digikam:17478): GLib-GObject-WARNING **: cannot register existing type 'GstObject'

(digikam:17478): GLib-CRITICAL **: g_once_init_leave: assertion 'result != 0' failed

(digikam:17478): GLib-GObject-CRITICAL **: g_type_register_static: assertion 'parent_type > 0' failed

(digikam:17478): GLib-CRITICAL **: g_once_init_leave: assertion 'result != 0' failed

(digikam:17478): GStreamer-CRITICAL **: gst_element_class_set_details_simple: assertion 'GST_IS_ELEMENT_CLASS (klass)' failed

(digikam:17478): GStreamer-WARNING **: static caps 0x7f42391cf650 string is NULL

ecc. ecc.

sl1pkn07 commented on 2015-01-14 19:43

Works for me

please paste the log when launch by console

blackhole commented on 2015-01-14 16:43

It compiled fine but starting hangs at "initializing main view"

sl1pkn07 commented on 2015-01-08 14:37

Sorry. I have no idea. I do not use gstreamer. My Qt5 copy (and other software) is compiled without gstreamer

greetings

anex commented on 2015-01-08 08:08

@ sl1pkn07, any solution to this bug?

https://bugs.kde.org/show_bug.cgi?id=342607

sl1pkn07 commented on 2015-01-03 18:04

change the version package (if dont show in updates. please reinstall) . and remove KHTML dependency

sl1pkn07 commented on 2014-12-29 21:26

libkgeomap i'ts not ready because need marble. and marble fails to build in kf5

https://bugs.kde.org/show_bug.cgi?id=342295

greetings

tajidinabd commented on 2014-12-29 21:25

have a question about the libkgeomap has this been ported to KF5 as of yet. I was searching around could not find a status for this library.

sl1pkn07 commented on 2014-12-29 19:03

yes. that file is provide by libkface. but you need the libkface-frameworks-git

libkface from [extra] is only for kde4/qt4

make you sure have a latest commit of libkface-frameworks-git

greetings

sl1pkn07 commented on 2014-12-29 18:59

yes. that file is provide by libkface. but you need the libkface-frameworks-git

libkface from [extra] is only for kde4/qt4

greetings

tajidinabd commented on 2014-12-29 18:53

well i try to build this file i get the following error

In file included from /tmp/yaourt-tmp-tajidinabd/aur-digikam-frameworks-git/src/digikam/libs/widgets/mainview/daboutdata.cpp:41:0:
/tmp/yaourt-tmp-tajidinabd/aur-digikam-frameworks-git/src/digikam/app/utils/componentsinfo.h:52:33: fatal error: recognitiondatabase.h: No such file or directory
#include <recognitiondatabase.h>
^
compilation terminated.
app/CMakeFiles/digikamcore.dir/build.make:4276: recipe for target 'app/CMakeFiles/digikamcore.dir/__/libs/widgets/mainview/daboutdata.cpp.o' failed
make[2]: *** [app/CMakeFiles/digikamcore.dir/__/libs/widgets/mainview/daboutdata.cpp.o] Error 1
CMakeFiles/Makefile2:777: recipe for target 'app/CMakeFiles/digikamcore.dir/all' failed
make[1]: *** [app/CMakeFiles/digikamcore.dir/all] Error 2
Makefile:117: recipe for target 'all' failed
make: *** [all] Error 2
==> ERROR: A failure occurred in build().
Aborting...



for me looking around is there an issue with "libkface"

perhaps on the right track?

sl1pkn07 commented on 2014-12-29 01:11

yes. i know (I talking about the problem to devs in the IRC)

for that i disable baloo in the cmake options

gretings

jeagoss commented on 2014-12-29 01:01

This package does not build against the latest baloo-git libraries. It is an upstream problem.

sl1pkn07 commented on 2014-12-29 00:46

oh XD

fixed

jeagoss commented on 2014-12-28 23:50

As usual, your packages are making it into my repo. :)

jeagoss commented on 2014-12-28 23:50

makedepends is misspelled. It is currently makedepemds.

paulbarbee commented on 2012-12-14 23:15

I completely forgot I was using KDE 4.10. Thank you for noticing that!

I searched for "digikam 4.10" and discovered a post on Arch's forums where someone couldn't get the digikam in the Extra repository to work because of libkdcraw. I re-installed libkdcraw-git and was able to re-install digikam-git without any problems.

paulbarbee commented on 2012-12-14 19:57

I completely forgot I was using KDE 4.10. Thank you for noticing that!

Sevenseven commented on 2012-12-14 18:14

>Found KDE 4.10
maybe this?
Successfully compiled with kde 4.9.4.

paulbarbee commented on 2012-12-14 05:31

I had trouble starting digikam today.
It gave me the following message: "digikam: error while loading shared libraries: libgphoto2_port.so.0: cannot open shared object file: No such file or directory"

I tried to reinstall digikam-git and it failed. I tried reinstalling all sources and reinstalling but it failed in the same place.

I have copied my re-installation attempt at http://pastebin.com/kdNyEc4a

I also tried building straight from git, which got a little farther in the make process. The patebin link to that attempt is http://pastebin.com/CR3TG1te

Thank you!

Sevenseven commented on 2012-10-03 11:10

Install them manually or use any aur frontend.

Phlogiston commented on 2012-10-01 18:56

Looks like some additional deps are not there:
==> Missing Dependencies:
-> libkipi-git
-> libkexiv2-git
-> libkdcraw-git
-> libksane-git
==> Checking buildtime dependencies...
==> Missing Dependencies:
-> libkgeomap-git
-> libkvkontakte-git
==> ERROR: Could not resolve all dependencies.
The build failed.

paulbarbee commented on 2012-06-11 21:36

I tried to install this package again today in order to get the full log, as per your suggestion, and it built fine.

Thanks again for your time and efforts!

Sevenseven commented on 2012-06-11 13:40

Please, post a full log via pastebin.

paulbarbee commented on 2012-06-11 05:08

I tried that but now I get [ 24%] Building CXX object digikam/CMakeFiles/digikamcore.dir/__/libs/threads/parallelworkers.o
/tmp/packerbuild-1000/digikam-git/digikam-git/src/digikam/libs/threads/parallelworkers.cpp: In member function 'int Digikam::ParallelWorkers::replacementQtMetacall(QMetaObject::Call, int, void**)':
/tmp/packerbuild-1000/digikam-git/digikam-git/src/digikam/libs/threads/parallelworkers.cpp:152:48: error: 'class QObject' has no member named 'mocMetaObject'
make[2]: *** [digikam/CMakeFiles/digikamcore.dir/__/libs/threads/parallelworkers.o] Error 1
make[1]: *** [digikam/CMakeFiles/digikamcore.dir/all] Error 2
make: *** [all] Error 2
==> ERROR: A failure occurred in build().
Aborting...

It builds and makes fine when I build from git source according to the digikam instructions at http://www.digikam.org/drupal/download?q=download/GIT

I find that very weird and don't understand why it happens.

Thank you very much for your help and for your work in Arch!

paulbarbee commented on 2012-06-11 05:07

I tried that but now I get [ 24%] Building CXX object digikam/CMakeFiles/digikamcore.dir/__/libs/threads/parallelworkers.o
/tmp/packerbuild-1000/digikam-git/digikam-git/src/digikam/libs/threads/parallelworkers.cpp: In member function 'int Digikam::ParallelWorkers::replacementQtMetacall(QMetaObject::Call, int, void**)':
/tmp/packerbuild-1000/digikam-git/digikam-git/src/digikam/libs/threads/parallelworkers.cpp:152:48: error: 'class QObject' has no member named 'mocMetaObject'
make[2]: *** [digikam/CMakeFiles/digikamcore.dir/__/libs/threads/parallelworkers.o] Error 1
make[1]: *** [digikam/CMakeFiles/digikamcore.dir/all] Error 2
make: *** [all] Error 2
==> ERROR: A failure occurred in build().
Aborting...

It builds and makes fine when I build from git source according to the digikam instructions at http://www.digikam.org/drupal/download?q=download/GIT

I find that very weird and don't understand why it happens.

Sevenseven commented on 2012-06-10 11:47

Update libkgeomap-git first.

paulbarbee commented on 2012-06-10 03:47

I tried to rebuild this package because it was looking for libmarblewidget.so.13. I get the following when trying to build:

Linking CXX executable testlensfuniface
/usr/bin/ld: warning: libmarblewidget.so.13, needed by /usr/lib/libkgeomap.so.1, not found (try using -rpath or -rpath-link)
/usr/lib/libkgeomap.so.1: undefined reference to `Marble::GeoPainter::autoMapQuality()'
/usr/lib/libkgeomap.so.1: undefined reference to `Marble::GeoDataLatLonBox::fromLineString(Marble::GeoDataLineString const&)'
/usr/lib/libkgeomap.so.1: undefined reference to `Marble::GeoDataLatLonBox::~GeoDataLatLonBox()'
/usr/lib/libkgeomap.so.1: undefined reference to `Marble::GeoDataLatLonBox::east(Marble::GeoDataCoordinates::Unit) const'
/usr/lib/libkgeomap.so.1: undefined reference to `Marble::LayerInterface::~LayerInterface()'
/usr/lib/libkgeomap.so.1: undefined reference to `Marble::MarbleWidget::setMapThemeId(QString const&)'
/usr/lib/libkgeomap.so.1: undefined reference to `Marble::GeoDataLatLonBox::north(Marble::GeoDataCoordinates::Unit) const'
/usr/lib/libkgeomap.so.1: undefined reference to `Marble::MarbleWidget::removeLayer(Marble::LayerInterface*)'
/usr/lib/libkgeomap.so.1: undefined reference to `Marble::GeoDataLatLonBox::width(Marble::GeoDataCoordinates::Unit) const'
/usr/lib/libkgeomap.so.1: undefined reference to `Marble::MarbleWidget::addLayer(Marble::LayerInterface*)'
/usr/lib/libkgeomap.so.1: undefined reference to `Marble::MarbleWidget::zoomOut(Marble::FlyToMode)'
/usr/lib/libkgeomap.so.1: undefined reference to `Marble::MarbleWidget::setShowScaleBar(bool)'
/usr/lib/libkgeomap.so.1: undefined reference to `Marble::LayerInterface::zValue() const'
/usr/lib/libkgeomap.so.1: undefined reference to `Marble::MarbleWidget::projection() const'
/usr/lib/libkgeomap.so.1: undefined reference to `Marble::MarbleWidget::staticMetaObject'
/usr/lib/libkgeomap.so.1: undefined reference to `Marble::MarbleWidget::zoom() const'
/usr/lib/libkgeomap.so.1: undefined reference to `Marble::MarbleWidget::centerLongitude() const'
/usr/lib/libkgeomap.so.1: undefined reference to `Marble::MarbleWidget::centerOn(Marble::GeoDataCoordinates const&, bool)'
/usr/lib/libkgeomap.so.1: undefined reference to `Marble::MarbleWidget::setCenterLongitude(double, Marble::FlyToMode)'
/usr/lib/libkgeomap.so.1: undefined reference to `Marble::GeoDataLatLonBox::setSouth(double, Marble::GeoDataCoordinates::Unit)'
/usr/lib/libkgeomap.so.1: undefined reference to `Marble::GeoPainter::drawPixmap(Marble::GeoDataCoordinates const&, QPixmap const&)'
/usr/lib/libkgeomap.so.1: undefined reference to `Marble::MarbleWidget::geoCoordinates(int, int, double&, double&, Marble::GeoDataCoordinates::Unit) const'
/usr/lib/libkgeomap.so.1: undefined reference to `Marble::GeoDataLatLonAltBox::~GeoDataLatLonAltBox()'
/usr/lib/libkgeomap.so.1: undefined reference to `Marble::GeoDataLatLonBox::setEast(double, Marble::GeoDataCoordinates::Unit)'
/usr/lib/libkgeomap.so.1: undefined reference to `Marble::GeoDataLatLonBox::west(Marble::GeoDataCoordinates::Unit) const'
/usr/lib/libkgeomap.so.1: undefined reference to `Marble::GeoDataLineString::GeoDataLineString(QFlags<Marble::TessellationFlag>)'
/usr/lib/libkgeomap.so.1: undefined reference to `Marble::GeoPainter::drawPixmap(int, int, QPixmap const&)'
/usr/lib/libkgeomap.so.1: undefined reference to `Marble::MarbleWidget::maximumZoom() const'
/usr/lib/libkgeomap.so.1: undefined reference to `Marble::ViewportParams::viewLatLonAltBox() const'
/usr/lib/libkgeomap.so.1: undefined reference to `Marble::GeoDataLatLonBox::setWest(double, Marble::GeoDataCoordinates::Unit)'
/usr/lib/libkgeomap.so.1: undefined reference to `Marble::GeoDataCoordinates::~GeoDataCoordinates()'
/usr/lib/libkgeomap.so.1: undefined reference to `Marble::GeoDataLinearRing::GeoDataLinearRing(QFlags<Marble::TessellationFlag>)'
/usr/lib/libkgeomap.so.1: undefined reference to `Marble::GeoDataLineString::append(Marble::GeoDataCoordinates const&)'
/usr/lib/libkgeomap.so.1: undefined reference to `Marble::MarbleWidget::zoomIn(Marble::FlyToMode)'
/usr/lib/libkgeomap.so.1: undefined reference to `Marble::MarbleWidget::MarbleWidget(QWidget*)'
/usr/lib/libkgeomap.so.1: undefined reference to `Marble::MarbleWidget::centerLatitude() const'
/usr/lib/libkgeomap.so.1: undefined reference to `Marble::MarbleWidget::centerOn(Marble::GeoDataLatLonBox const&, bool)'
/usr/lib/libkgeomap.so.1: undefined reference to `Marble::MarbleWidget::screenCoordinates(double, double, double&, double&) const'
/usr/lib/libkgeomap.so.1: undefined reference to `Marble::MarbleWidget::setShowCompass(bool)'
/usr/lib/libkgeomap.so.1: undefined reference to `Marble::GeoDataLineString::~GeoDataLineString()'
/usr/lib/libkgeomap.so.1: undefined reference to `Marble::MarbleWidget::setShowOverviewMap(bool)'
/usr/lib/libkgeomap.so.1: undefined reference to `Marble::GeoDataLatLonBox::south(Marble::GeoDataCoordinates::Unit) const'
/usr/lib/libkgeomap.so.1: undefined reference to `Marble::MarbleWidget::viewport()'
/usr/lib/libkgeomap.so.1: undefined reference to `Marble::MarbleWidget::setCenterLatitude(double, Marble::FlyToMode)'
/usr/lib/libkgeomap.so.1: undefined reference to `Marble::GeoDataCoordinates::GeoDataCoordinates(double, double, double, Marble::GeoDataCoordinates::Unit, int)'
/usr/lib/libkgeomap.so.1: undefined reference to `typeinfo for Marble::LayerInterface'
/usr/lib/libkgeomap.so.1: undefined reference to `Marble::MarbleWidget::minimumZoom() const'
/usr/lib/libkgeomap.so.1: undefined reference to `Marble::GeoPainter::drawPolygon(Marble::GeoDataLinearRing const&, Qt::FillRule)'
/usr/lib/libkgeomap.so.1: undefined reference to `Marble::GeoDataLatLonBox::setNorth(double, Marble::GeoDataCoordinates::Unit)'
/usr/lib/libkgeomap.so.1: undefined reference to `Marble::MarbleWidget::setProjection(Marble::Projection)'
/usr/lib/libkgeomap.so.1: undefined reference to `Marble::GeoDataLineString::operator<<(Marble::GeoDataCoordinates const&)'
/usr/lib/libkgeomap.so.1: undefined reference to `Marble::GeoDataLatLonBox::height(Marble::GeoDataCoordinates::Unit) const'
/usr/lib/libkgeomap.so.1: undefined reference to `Marble::GeoDataLinearRing::~GeoDataLinearRing()'
/usr/lib/libkgeomap.so.1: undefined reference to `Marble::MarbleWidget::zoomView(int, Marble::FlyToMode)'
collect2: error: ld returned 1 exit status
make[2]: *** [libs/dimg/filters/lens/testlensfuniface] Error 1
make[1]: *** [libs/dimg/filters/lens/CMakeFiles/testlensfuniface.dir/all] Error 2
make: *** [all] Error 2
==> ERROR: A failure occurred in build().
Aborting...
The build failed.

Sevenseven commented on 2011-06-09 02:52

Updated.

agaida commented on 2011-06-08 16:04

Please add boost as dependency. Thanks.

>-- Boost Graph library found................ NO
>--
>CMake Error at CMakeLists.txt:92 (MESSAGE):
> digiKam needs Boost Graph. You need to install the Boost Graph (headers only) library development package.

Sevenseven commented on 2011-05-21 01:47

Sorry, i am use yaourt.

Phlogiston commented on 2011-05-20 15:47

Thanks, and to update everything I simply do: packer -S kipi-plugins-git libkface-git libkmap-git digikam-git --noconfirm

correct?

Sevenseven commented on 2011-05-07 01:34

Yes, just rebuild kdegraphics, here is pkgbuild http://pastebin.com/HmMrtNPu

Phlogiston commented on 2011-05-06 23:29

Is it possible to make this package and its dependencies non coflictable?

:: kdegraphics-libs and libkdcraw-git are in conflict. Remove libkdcraw-git? [y/N] n

I'd like to use gwenview with digikam-git ...

Sevenseven commented on 2011-03-14 01:30

Yes, i can

flamelab commented on 2011-03-13 19:20

Sevenseven, could you adopt it ? I have orphaned all of the digikam-git related packages.

Sevenseven commented on 2011-03-13 10:01

new ver, please test
http://pastebin.com/paw31iBb

Anonymous comment on 2011-02-21 22:20

@77: great, thanks! compiles, runs : )

Sevenseven commented on 2011-02-21 01:37

pkgbuild for 2.x, maybe they need some fix
http://aur.pastebin.com/zfFTcVn5

Sevenseven commented on 2011-02-14 15:36

1.9

flamelab commented on 2011-02-14 15:14

Is master branch still 1.9 or have they passed to 2.x ?

All kde stuff from git/svn ? Hehe.... XD

Sevenseven commented on 2011-02-14 15:04

Compiles fine from master branch( all kde`s stuf from git/svn).

flamelab commented on 2011-02-13 09:13

I have limited free time these days, I'll investigate this next week. If anybody finds something, please report it here :)

Anonymous comment on 2011-02-12 21:11

Does not compile with kdegraphics 4.6.0, also fails with aur-package kdegraphics-libs-digikam2-svn, with a similar message as reported by skarn. Hints?

skarn commented on 2011-02-07 21:10

Trying to build results in

drawdecoding.cpp:229:5: error: ‘const class KDcrawIface::RawDecodingSettings’ has no member named ‘NRType’
drawdecoding.cpp:229:5: error: ‘class KDcrawIface::RawDecodingSettings’ has no member named ‘NRType’

and a couple dozen similar messages, alla missing fileds in libkdcraw.

Perhaps it needs a newer version than the one included in kdegraphics-libs?

flamelab commented on 2011-02-07 13:01

It's been fixed, I had the updated PKGBUILD ready but hadn't uploaded it yet.

If we need any missing dependency, please tell me !

Sevenseven commented on 2011-02-07 07:45

kipi-plugins-svn removed from aur, use kipi-plugins-git

Sevenseven commented on 2011-02-07 07:45

kipi-plugins-svn removed from aur, use kipi-plugins-git

overmind88 commented on 2011-02-07 04:46

Maybe change kipi-plugins-svn to kipi-plugins-git?