Package Details: distrho-ports-lv2-git r492.062a0f61-1

Git Clone URL: (read-only, click to copy)
Package Base: distrho-ports-lv2-git
Description: Distrho LV2 Audio Plugins, using the JUCE Toolkit
Upstream URL:
Licenses: GPL, GPL3
Conflicts: distrho-git, distrho-ports
Provides: distrho-ports-lv2
Submitter: daniel.appelt
Maintainer: daniel.appelt
Last Packager: daniel.appelt
Votes: 8
Popularity: 0.000001
First Submitted: 2020-11-03 09:42
Last Updated: 2020-11-03 09:42

Latest Comments

1 2 Next › Last »

yin commented on 2021-05-02 20:54

==> Starting pkgver()...
==> Starting build()...
The Meson build system
Version: 0.58.0
Source dir: /var/cache/pacman/aur/distrho-ports-lv2-git/src/distrho-ports
Build dir: /var/cache/pacman/aur/distrho-ports-lv2-git/src/distrho-ports/build
Build type: native build
Project name: DISTRHO-Ports
Project version: undefined ERROR: Could not invoke sanity test executable: [Errno 13] Permission denied: '/var/cache/pacman/aur/distrho-ports-lv2-git/src/distrho-ports/build/meson-private/sanitycheckc.exe'.

daniel.appelt commented on 2020-08-11 18:03

@rcrath: Thx for the feedback! It should work now!

rcrath commented on 2020-08-11 02:17

Builds fine upstream to /usr/local/lv2

rcrath commented on 2020-08-11 00:16

fails with problem with copy command path (/usr/lib, not /usr/bin)?

``````````````````````````````````````````````````````````````` [540/540] Linking target ports-legacy/ ==> Entering fakeroot environment... ==> Starting package()... cp: cannot stat 'bin/lv2/*.lv2': No such file or directory <<<<<<<<<<<<<<< ==> ERROR: A failure occurred in package(). Aborting... `````````````````````````````````````````````````````````````````````

falkTX commented on 2020-01-26 18:05

I fixed EasySSP build by disabling a specific optimization during its build. You can switch back to use gcc again.

daniel.appelt commented on 2019-12-26 23:07

@rcrath: I just updated the PKGBUILD to use clang instead of gcc for now. The problem with gcc has been reported upstream:

rcrath commented on 2019-10-29 02:22

distrho-lv2-git fails with following.

../source/GoniometerControl.h:88:7: internal compiler error: in vect_schedule_slp_instance, at tree-vect-slp.c:3922
   88 |  void paint (Graphics& g)
      |       ^~~~~
Please submit a full bug report,
with preprocessed source if appropriate.
See <> for instructions.
make[3]: *** [EasySSP.lv2/EasySSP.make:97: intermediate/Release/PluginProcessor.o] Error 1
make[2]: *** [Makefile:22: EasySSP.lv2/EasySSP] Error 2
make[2]: Leaving directory '/tmp/yaourt-tmp-rich/aur-distrho-lv2-git/src/distrho-lv2/ports/easySSP/LV2'
make[1]: *** [Makefile:31: lv2] Error 2
make[1]: Leaving directory '/tmp/yaourt-tmp-rich/aur-distrho-lv2-git/src/distrho-lv2/ports'
make: *** [Makefile:108: lv2] Error 2
==> ERROR: A failure occurred in build().
==> ERROR: Makepkg was unable to build distrho-lv2-git.
==> Restart building distrho-lv2-git ? [y/N]

Ralf_Mardorf commented on 2019-08-08 07:18

It doesn't build anymore.

[rocketmouse@archlinux distrho-lv2-git]$ ls -goA
total 8
-rw-r--r-- 1 1114 Mar  4  2016 PKGBUILD
-rw-r--r-- 1  746 Mar  4  2016 .SRCINFO
[rocketmouse@archlinux distrho-lv2-git]$ makepkg -s
==> Making package: distrho-lv2-git r336.7bcbc9b-4 (Thu 08 Aug 2019 09:13:29 AM CEST)
==> Updated version: distrho-lv2-git r413.500ac85e-1
==> Starting build()...
make -C libs/drowaudio
make[1]: Entering directory '/tmp/distrho-lv2-git/src/distrho-lv2/libs/drowaudio'
make -C build-drowaudio
make[2]: Entering directory '/tmp/distrho-lv2-git/src/distrho-lv2/libs/drowaudio/build-drowaudio'
==== Building drowaudio ====
In file included from ../../juce/source/modules/juce_graphics/juce_graphics.h:111,
                 from ../../juce/source/modules/juce_audio_devices/juce_audio_devices.h:58,
                 from ../source/dRowAudio/dRowAudio.h:144,
                 from ../source/dRowAudio/dRowAudio.cpp:47:
../../juce/source/modules/juce_graphics/colour/juce_PixelFormats.h: In member function ‘juce::uint8& juce::PixelARGB::getAlpha()’:
../../juce/source/modules/juce_graphics/colour/juce_PixelFormats.h:114:77: error: cannot bind packed field ‘((juce::PixelARGB*)this)->juce::PixelARGB::<anonymous>.juce::PixelARGB::<unnamed union>::comps[3]’ to ‘juce::uint8&’ {aka ‘unsigned char&’}
  114 |     forcedinline uint8& getAlpha() noexcept           { return comps [indexA]; }
      |                                                                ~~~~~~~~~~~~~^
../../juce/source/modules/juce_graphics/colour/juce_PixelFormats.h: In member function ‘juce::uint8& juce::PixelARGB::getRed()’:
../../juce/source/modules/juce_graphics/colour/juce_PixelFormats.h:115:77: error: cannot bind packed field ‘((juce::PixelARGB*)this)->juce::PixelARGB::<anonymous>.juce::PixelARGB::<unnamed union>::comps[2]’ to ‘juce::uint8&’ {aka ‘unsigned char&’}
  115 |     forcedinline uint8& getRed() noexcept             { return comps [indexR]; }
      |                                                                ~~~~~~~~~~~~~^
../../juce/source/modules/juce_graphics/colour/juce_PixelFormats.h: In member function ‘juce::uint8& juce::PixelARGB::getGreen()’:
../../juce/source/modules/juce_graphics/colour/juce_PixelFormats.h:116:77: error: cannot bind packed field ‘((juce::PixelARGB*)this)->juce::PixelARGB::<anonymous>.juce::PixelARGB::<unnamed union>::comps[1]’ to ‘juce::uint8&’ {aka ‘unsigned char&’}
  116 |     forcedinline uint8& getGreen() noexcept           { return comps [indexG]; }
      |                                                                ~~~~~~~~~~~~~^
../../juce/source/modules/juce_graphics/colour/juce_PixelFormats.h: In member function ‘juce::uint8& juce::PixelARGB::getBlue()’:
../../juce/source/modules/juce_graphics/colour/juce_PixelFormats.h:117:77: error: cannot bind packed field ‘((juce::PixelARGB*)this)->juce::PixelARGB::<anonymous>.juce::PixelARGB::<unnamed union>::comps[0]’ to ‘juce::uint8&’ {aka ‘unsigned char&’}
  117 |     forcedinline uint8& getBlue() noexcept            { return comps [indexB]; }
make[3]: *** [drowaudio.make:87: intermediate/Release/dRowAudio.o] Error 1
make[2]: *** [Makefile:22: drowaudio] Error 2
make[2]: Leaving directory '/tmp/distrho-lv2-git/src/distrho-lv2/libs/drowaudio/build-drowaudio'
make[1]: *** [Makefile:4: all] Error 2
make[1]: Leaving directory '/tmp/distrho-lv2-git/src/distrho-lv2/libs/drowaudio'
make: *** [Makefile:104: lv2] Error 2
==> ERROR: A failure occurred in build().

sekret commented on 2018-05-18 14:33

Confirmed, builds fine in a clean chroot.

daniel.appelt commented on 2018-05-18 13:10

@Renfield: Is it possible that your AUR helper is caching old build artifacts? Please try cleaning any build cache that could be involved. I have build the package without problems last week and there hasn't been any updates since.