Package Details: dosbox-daum 20150125-5

Git Clone URL: (read-only, click to copy)
Package Base: dosbox-daum
Description: Emulator with builtin DOS for running DOS Games (Daum version)
Upstream URL:
Licenses: GPL
Conflicts: dosbox
Provides: dosbox
Submitter: oi_wtf
Maintainer: oi_wtf
Last Packager: oi_wtf
Votes: 9
Popularity: 0.022140
First Submitted: 2015-06-16 21:17
Last Updated: 2018-10-15 21:12

Required by (62)

Sources (9)

Pinned Comments

oi_wtf commented on 2018-09-25 12:17

READ this before building: For this package a sdl_sound package of the 'stable-1.0' branch is needed.

Either modify sdl_sound-hg to use that branch or use sdl_sound-hg_daum package.

Latest Comments

« First ‹ Previous 1 2 3

CyberConan commented on 2017-02-11 12:43

Hi, I have the same error (in spanish):

drive_physfs.cpp: En la función miembro ‘virtual void* physfsDrive::opendir(const char*)’:
drive_physfs.cpp:418:42: error: no se puede convertir ‘bool’ a ‘void*’ en la devolución
if (!PHYSFS_isDirectory(myname)) return false;

I have could compile replacing in this file false for 0 but I don't know if is the best solution.

oi_wtf commented on 2017-02-10 21:50

Sorry, can't reproduce your error.
Did you change CFLAGS, CXXFLAGS or LDFLAGS in makepkg.conf?
Do you use some other compiler than standard gcc?
On my system that's currently: gcc-multilib 6.3.1-1 from [multilib]...

Anonymous comment on 2017-02-06 21:06

Getting an error installing with yaourt...

drive_physfs.cpp: In member function ‘virtual void* physfsDrive::opendir(const char*)’:
drive_physfs.cpp:418:42: error: cannot convert ‘bool’ to ‘void*’ in return
if (!PHYSFS_isDirectory(myname)) return false;
make[3]: *** [Makefile:385: drive_physfs.o] Error 1
make[3]: Leaving directory '/tmp/yaourt-tmp-tom/aur-dosbox-daum/src/src/dos'
make[2]: *** [Makefile:480: all-recursive] Error 1
make[2]: Leaving directory '/tmp/yaourt-tmp-tom/aur-dosbox-daum/src/src'
make[1]: *** [Makefile:378: all-recursive] Error 1
make[1]: Leaving directory '/tmp/yaourt-tmp-tom/aur-dosbox-daum/src'
make: *** [Makefile:319: all] Error 2
==> ERROR: A failure occurred in build().

unknown78 commented on 2016-03-19 17:37

I supose because of the new nvidia driver it crashes if you use openglhq as output. __GLVND_DISALLOW_PATCHING=1 << doesn't work. Using opengl as output surface works.

oi_wtf commented on 2015-12-06 12:43

I don't know.
Maybe there's some info at
but I can't tell since I can't read korean. :(

aaronp commented on 2015-11-27 03:39

The site has been down for a few days now. is the project dead? :(