Package Details: dotnet 1.1.1-1

Git Clone URL: https://aur.archlinux.org/dotnet.git (read-only)
Package Base: dotnet
Description: Provides the .NET core shared framework, i.e. coreclr and corefx.
Upstream URL: https://www.microsoft.com/net/core
Licenses: MIT
Conflicts: dotnet-bin
Provides: dotnet=1.1.1
Submitter: gegenschall
Maintainer: gegenschall
Last Packager: gegenschall
Votes: 16
Popularity: 9.959081
First Submitted: 2017-03-08 11:17
Last Updated: 2017-03-08 11:17

Latest Comments

kuplerei commented on 2017-04-22 22:48

I found a solution to which many people complain about.

/var/tmp/aur-build/dotnet/src/coreclr-1.1.1/src/pal/inc/pal.h:5979:22: error: definition of builtin function '_rotl'
unsigned int __cdecl _rotl(unsigned int value, int shift)
^
/var/tmp/aur-build/dotnet/src/coreclr-1.1.1/src/pal/inc/pal.h:6002:22: error: definition of builtin function '_rotr'
unsigned int __cdecl _rotr(unsigned int value, int shift)

Downgrade clang, llvam, llvm-libs to 3.9.1-2
I used the downgrade package to do that.

zunder commented on 2017-04-22 20:16

Sorry, did miss that line:

/usr/bin/ld: final link failed: No space left on device

It was actually obvious. Thank you for the quick reply.

gegenschall commented on 2017-04-22 19:03

Please see my comment on the dotnet-sdk AUR package concerning out of space errors.

zunder commented on 2017-04-22 18:59

Getting following error:

[ 77%] Linking CXX executable paltest_getenvironmentvariablew_test6
/usr/bin/ld: final link failed: No space left on device
clang-3.9: error: linker command failed with exit code 1 (use -v to see invocation)
make[2]: *** [src/pal/tests/palsuite/miscellaneous/GetEnvironmentVariableW/test4/CMakeFiles/paltest_getenvironmentvariablew_test4.dir/build.make:99: src/pal/tests/palsuite/miscellaneous/GetEnvironmentVariableW/test4/paltest_getenvironmentvariablew_test4] Error 1
make[1]: *** [CMakeFiles/Makefile2:49488: src/pal/tests/palsuite/miscellaneous/GetEnvironmentVariableW/test4/CMakeFiles/paltest_getenvironmentvariablew_test4.dir/all] Error 2
make[1]: *** Waiting for unfinished jobs....
[ 77%] Linking CXX executable paltest_getlasterror_test1
/usr/bin/ld: final link failed: No space left on device
clang-3.9: error: linker command failed with exit code 1 (use -v to see invocation)
make[2]: *** [src/pal/tests/palsuite/miscellaneous/GetEnvironmentVariableW/test5/CMakeFiles/paltest_getenvironmentvariablew_test5.dir/build.make:99: src/pal/tests/palsuite/miscellaneous/GetEnvironmentVariableW/test5/paltest_getenvironmentvariablew_test5] Error 1
make[1]: *** [CMakeFiles/Makefile2:49543: src/pal/tests/palsuite/miscellaneous/GetEnvironmentVariableW/test5/CMakeFiles/paltest_getenvironmentvariablew_test5.dir/all] Error 2
[ 77%] Linking CXX executable paltest_getsysteminfo_test1
/usr/bin/ld: final link failed: No space left on device
clang-3.9: error: linker command failed with exit code 1 (use -v to see invocation)
make[2]: *** [src/pal/tests/palsuite/miscellaneous/GetEnvironmentVariableW/test6/CMakeFiles/paltest_getenvironmentvariablew_test6.dir/build.make:99: src/pal/tests/palsuite/miscellaneous/GetEnvironmentVariableW/test6/paltest_getenvironmentvariablew_test6] Error 1
make[1]: *** [CMakeFiles/Makefile2:49598: src/pal/tests/palsuite/miscellaneous/GetEnvironmentVariableW/test6/CMakeFiles/paltest_getenvironmentvariablew_test6.dir/all] Error 2
/usr/bin/ld: final link failed: No space left on device
clang-3.9: error: linker command failed with exit code 1 (use -v to see invocation)
make[2]: *** [src/pal/tests/palsuite/miscellaneous/GetLastError/test1/CMakeFiles/paltest_getlasterror_test1.dir/build.make:99: src/pal/tests/palsuite/miscellaneous/GetLastError/test1/paltest_getlasterror_test1] Error 1
make[1]: *** [CMakeFiles/Makefile2:49671: src/pal/tests/palsuite/miscellaneous/GetLastError/test1/CMakeFiles/paltest_getlasterror_test1.dir/all] Error 2
/usr/bin/ld: final link failed: No space left on device
clang-3.9: error: linker command failed with exit code 1 (use -v to see invocation)
make[2]: *** [src/pal/tests/palsuite/miscellaneous/GetSystemInfo/test1/CMakeFiles/paltest_getsysteminfo_test1.dir/build.make:99: src/pal/tests/palsuite/miscellaneous/GetSystemInfo/test1/paltest_getsysteminfo_test1] Error 1
make[1]: *** [CMakeFiles/Makefile2:49744: src/pal/tests/palsuite/miscellaneous/GetSystemInfo/test1/CMakeFiles/paltest_getsysteminfo_test1.dir/all] Error 2Python[ 77%] Linking CXX executable paltest_getenvironmentvariablew_test6
/usr/bin/ld: final link failed: No space left on device
clang-3.9: error: linker command failed with exit code 1 (use -v to see invocation)
make[2]: *** [src/pal/tests/palsuite/miscellaneous/GetEnvironmentVariableW/test4/CMakeFiles/paltest_getenvironmentvariablew_test4.dir/build.make:99: src/pal/tests/palsuite/miscellaneous/GetEnvironmentVariableW/test4/paltest_getenvironmentvariablew_test4] Error 1
make[1]: *** [CMakeFiles/Makefile2:49488: src/pal/tests/palsuite/miscellaneous/GetEnvironmentVariableW/test4/CMakeFiles/paltest_getenvironmentvariablew_test4.dir/all] Error 2
make[1]: *** Waiting for unfinished jobs....
[ 77%] Linking CXX executable paltest_getlasterror_test1
/usr/bin/ld: final link failed: No space left on device
clang-3.9: error: linker command failed with exit code 1 (use -v to see invocation)
make[2]: *** [src/pal/tests/palsuite/miscellaneous/GetEnvironmentVariableW/test5/CMakeFiles/paltest_getenvironmentvariablew_test5.dir/build.make:99: src/pal/tests/palsuite/miscellaneous/GetEnvironmentVariableW/test5/paltest_getenvironmentvariablew_test5] Error 1
make[1]: *** [CMakeFiles/Makefile2:49543: src/pal/tests/palsuite/miscellaneous/GetEnvironmentVariableW/test5/CMakeFiles/paltest_getenvironmentvariablew_test5.dir/all] Error 2
[ 77%] Linking CXX executable paltest_getsysteminfo_test1
/usr/bin/ld: final link failed: No space left on device
clang-3.9: error: linker command failed with exit code 1 (use -v to see invocation)
make[2]: *** [src/pal/tests/palsuite/miscellaneous/GetEnvironmentVariableW/test6/CMakeFiles/paltest_getenvironmentvariablew_test6.dir/build.make:99: src/pal/tests/palsuite/miscellaneous/GetEnvironmentVariableW/test6/paltest_getenvironmentvariablew_test6] Error 1
make[1]: *** [CMakeFiles/Makefile2:49598: src/pal/tests/palsuite/miscellaneous/GetEnvironmentVariableW/test6/CMakeFiles/paltest_getenvironmentvariablew_test6.dir/all] Error 2
/usr/bin/ld: final link failed: No space left on device
clang-3.9: error: linker command failed with exit code 1 (use -v to see invocation)
make[2]: *** [src/pal/tests/palsuite/miscellaneous/GetLastError/test1/CMakeFiles/paltest_getlasterror_test1.dir/build.make:99: src/pal/tests/palsuite/miscellaneous/GetLastError/test1/paltest_getlasterror_test1] Error 1
make[1]: *** [CMakeFiles/Makefile2:49671: src/pal/tests/palsuite/miscellaneous/GetLastError/test1/CMakeFiles/paltest_getlasterror_test1.dir/all] Error 2
/usr/bin/ld: final link failed: No space left on device
clang-3.9: error: linker command failed with exit code 1 (use -v to see invocation)
make[2]: *** [src/pal/tests/palsuite/miscellaneous/GetSystemInfo/test1/CMakeFiles/paltest_getsysteminfo_test1.dir/build.make:99: src/pal/tests/palsuite/miscellaneous/GetSystemInfo/test1/paltest_getsysteminfo_test1] Error 1
make[1]: *** [CMakeFiles/Makefile2:49744: src/pal/tests/palsuite/miscellaneous/GetSystemInfo/test1/CMakeFiles/paltest_getsysteminfo_test1.dir/all] Error 2
make: *** [Makefile:128: all] Error 2
Failed to build coreclr components.

make: *** [Makefile:128: all] Error 2
Failed to build coreclr components.

ggobbe commented on 2017-04-22 07:37

Hi, I am having the same issues with rotl and rotr builtin functions.
Also, thanks @gegenshall for making those packages :)

Full log: https://pastebin.com/m15jrhCB
-----
/var/tmp/aur-build/dotnet/src/coreclr-1.1.1/src/pal/inc/pal.h:5979:22: error: definition of builtin function '_rotl'
unsigned int __cdecl _rotl(unsigned int value, int shift)
^
/var/tmp/aur-build/dotnet/src/coreclr-1.1.1/src/pal/inc/pal.h:6002:22: error: definition of builtin function '_rotr'
unsigned int __cdecl _rotr(unsigned int value, int shift)

pms1969 commented on 2017-04-21 14:45

I'm having trouble with this..

I'm getting the following error when running pacaur -S dotnet
-----
In file included from /home/paul/.cache/pacaur/dotnet/src/coreclr-1.1.1/bin/obj/Linux.x64.Release/Generated/eventprovider/lttng/eventprovdotnetruntimeprivate.cpp:20:
/home/paul/.cache/pacaur/dotnet/src/coreclr-1.1.1/src/pal/inc/pal.h:5979:22: error: definition of builtin function '_rotl'
unsigned int __cdecl _rotl(unsigned int value, int shift)
^
/home/paul/.cache/pacaur/dotnet/src/coreclr-1.1.1/src/pal/inc/pal.h:6002:22: error: definition of builtin function '_rotr'
unsigned int __cdecl _rotr(unsigned int value, int shift)
^
In file included from /home/paul/.cache/pacaur/dotnet/src/coreclr-1.1.1/bin/obj/Linux.x64.Release/Generated/eventprovider/lttng/eventprovdotnetruntimestress.cpp:20:
/home/paul/.cache/pacaur/dotnet/src/coreclr-1.1.1/src/pal/inc/pal.h:5979:22: error: definition of builtin function '_rotl'
unsigned int __cdecl _rotl(unsigned int value, int shift)
^
/home/paul/.cache/pacaur/dotnet/src/coreclr-1.1.1/src/pal/inc/pal.h:6002:22: error: definition of builtin function '_rotr'
unsigned int __cdecl _rotr(unsigned int value, int shift)
-----

Any idea what might be happening.

And thanks for making this available.

Merurino commented on 2017-04-14 01:10

Hey @gegenshall, just would like to thank you for making all these .net core related AUR packages. Thanks a lot :)

gegenschall commented on 2017-04-06 12:55

@dotsev: You seem to have OpenSSL 1.1.0e (from testing?) installed. OpenSSL 1.1.0e is not backwards compatible to 1.0.x and coreclr only builds against 1.0.x. You have to either downgrade your OpenSSL to 1.0.x or find a patch to coreclr that enables OpenSSL 1.1.x.

The OpenSSL project has a wiki page[0] on this where they also offer a compat lib. You could use the .h/.c in that to make it work with 1.1.x...

edit: I'll update the packages in the next few days to reflect this, i.e. give it a 'openssl<1.1.0' dependency.

---

[0] https://wiki.openssl.org/index.php/OpenSSL_1.1.0_Changes
[1] https://wiki.openssl.org/images/e/ed/Openssl-compat.tar.gz

dotsev commented on 2017-04-05 16:22

I get an error when trying to build dotnet-sdk, which depends on this package.

https://pastebin.com/zCygWtZH

Do you have any ideas of how to fix the issue?