Package Details: dssi-vst 0.9.2-9

Git Clone URL: https://aur.archlinux.org/dssi-vst.git (read-only, click to copy)
Package Base: dssi-vst
Description: DSSI adapter/wrapper for win32 VST plug-ins
Upstream URL: https://www.breakfastquay.com/dssi-vst/
Licenses: GPL2
Submitter: dvzrv
Maintainer: None
Last Packager: dvzrv
Votes: 1
Popularity: 0.000000
First Submitted: 2019-02-22 19:50 (UTC)
Last Updated: 2019-02-22 19:50 (UTC)

Latest Comments

dreieck commented on 2021-04-24 20:16 (UTC)

Build fails for me:

==> Starting build()...
wineg++ -m32 -Ivestige -Wall -fPIC remotepluginclient.cpp -c -o remotepluginclient.w32.o
wineg++ -m32 -Ivestige -Wall -fPIC remotepluginserver.cpp -c -o remotepluginserver.w32.o
wineg++ -m32 -Ivestige -Wall -fPIC rdwrops.cpp -c -o rdwrops.w32.o
wineg++ -m32 -Ivestige -Wall -fPIC paths.cpp -c -o paths.w32.o
In file included from /usr/include/c++/10.2.0/ext/string_conversions.h:41,
                 from /usr/include/c++/10.2.0/bits/basic_string.h:6535,
                 from /usr/include/c++/10.2.0/string:55,
                 from rdwrops.h:10,
                 from rdwrops.cpp:10:
/usr/include/c++/10.2.0/cstdlib:75:15: fatal error: stdlib.h: No such file or directory
   75 | #include_next <stdlib.h>
      |               ^~~~~~~~~~
compilation terminated.
In file included from /usr/include/c++/10.2.0/ext/string_conversions.h:41,
                 from /usr/include/c++/10.2.0/bits/basic_string.h:6535,
                 from /usr/include/c++/10.2.0/string:55,
                 from paths.h:12,
                 from paths.cpp:8:
/usr/include/c++/10.2.0/cstdlib:75:15: fatal error: stdlib.h: No such file or directory
   75 | #include_next <stdlib.h>
      |               ^~~~~~~~~~
compilation terminated.
In file included from /usr/include/c++/10.2.0/ext/string_conversions.h:41,
                 from /usr/include/c++/10.2.0/bits/basic_string.h:6535,
                 from /usr/include/c++/10.2.0/string:55,
                 from remotepluginserver.h:12,
                 from remotepluginserver.cpp:8:
/usr/include/c++/10.2.0/cstdlib:75:15: fatal error: stdlib.h: No such file or directory
   75 | #include_next <stdlib.h>
      |               ^~~~~~~~~~
compilation terminated.
In file included from /usr/include/c++/10.2.0/ext/string_conversions.h:41,
                 from /usr/include/c++/10.2.0/bits/basic_string.h:6535,
                 from /usr/include/c++/10.2.0/string:55,
                 from remotepluginclient.h:12,
                 from remotepluginclient.cpp:8:
/usr/include/c++/10.2.0/cstdlib:75:15: fatal error: stdlib.h: No such file or directory
   75 | #include_next <stdlib.h>
      |               ^~~~~~~~~~
compilation terminated.
winegcc: /sbin/g++ failed
winegcc: /sbin/g++ failed
make: *** [Makefile:68: remotepluginclient.w32.o] Error 2
make: *** Waiting for unfinished jobs....
make: *** [Makefile:68: paths.w32.o] Error 2
winegcc: /sbin/g++ failed
make: *** [Makefile:68: rdwrops.w32.o] Error 2
winegcc: /sbin/g++ failed
make: *** [Makefile:68: remotepluginserver.w32.o] Error 2
==> ERROR: A failure occurred in build().
    Aborting...