Package Details: edex-ui 2.2.8-1

Git Clone URL: https://aur.archlinux.org/edex-ui.git (read-only, click to copy)
Package Base: edex-ui
Description: A cross-platform, customizable science fiction terminal emulator with advanced monitoring & touchscreen support.
Upstream URL: https://github.com/GitSquared/edex-ui
Keywords: electron nodejs science-fiction terminal tron
Licenses: GPL3
Provides: edex-ui
Submitter: icanwalkonwater
Maintainer: GitSquared
Last Packager: GitSquared
Votes: 15
Popularity: 0.001702
First Submitted: 2018-11-22 17:43 (UTC)
Last Updated: 2021-10-18 20:52 (UTC)

Latest Comments

reefland commented on 2021-11-03 17:44 (UTC) (edited on 2021-11-03 17:45 (UTC) by reefland)

Have 2.2.7-1 installed, unable to update to 2.2.8-1, fails with:

Error: Cannot find module 'fs/promises'
Require stack:
- /var/tmp/pamac-build-rich/edex-ui/src/edex-ui-2.2.8/node_modules/builder-util/out/fs.js
- /var/tmp/pamac-build-rich/edex-ui/src/edex-ui-2.2.8/node_modules/builder-util/out/util.js
- /var/tmp/pamac-build-rich/edex-ui/src/edex-ui-2.2.8/node_modules/electron-builder/out/cli/cli.js
- /var/tmp/pamac-build-rich/edex-ui/src/edex-ui-2.2.8/node_modules/electron-builder/cli.js
    at Function.Module._resolveFilename (internal/modules/cjs/loader.js:815:15)
    at Function.Module._load (internal/modules/cjs/loader.js:667:27)
    at Module.require (internal/modules/cjs/loader.js:887:19)
    at require (internal/modules/cjs/helpers.js:74:18)
    at Object.<anonymous> (/var/tmp/pamac-build-rich/edex-ui/src/edex-ui-2.2.8/node_modules/builder-util/src/fs.ts:4:1)
    at Module._compile (internal/modules/cjs/loader.js:999:30)
    at Object.Module._extensions..js (internal/modules/cjs/loader.js:1027:10)
    at Module.load (internal/modules/cjs/loader.js:863:32)
    at Function.Module._load (internal/modules/cjs/loader.js:708:14)
    at Module.require (internal/modules/cjs/loader.js:887:19)
    at require (internal/modules/cjs/helpers.js:74:18)
    at Object.<anonymous> (/var/tmp/pamac-build-rich/edex-ui/src/edex-ui-2.2.8/node_modules/builder-util/src/util.ts:25:1)
    at Module._compile (internal/modules/cjs/loader.js:999:30)
    at Object.Module._extensions..js (internal/modules/cjs/loader.js:1027:10)
    at Module.load (internal/modules/cjs/loader.js:863:32)
    at Function.Module._load (internal/modules/cjs/loader.js:708:14)
==> ERROR: A failure occurred in build().

On Manjaro which often makes a difference.

madjoe commented on 2021-03-18 21:02 (UTC)

Got an error during installation and therefore can't install it:

==> Starting build()...
npm ERR! semver.simplifyRange is not a function

jeff_vt commented on 2020-10-30 16:52 (UTC)

It seems that makepkg for this package does not work on a pinebook pro running Manjaro. If you would like, I saved the 35K build output that I can send along, plus any other info you need.

GitSquared commented on 2020-10-14 17:10 (UTC)

@Concerto upstream software doesn't support erbium

for a more up-to-date package try edex-ui-git

Concerto commented on 2020-10-14 16:56 (UTC)

Can we update this from dubnium to 12?

zwork commented on 2020-05-20 15:34 (UTC)

Got an error trying to install

==> Starting build()...
node: error while loading shared libraries: libicui18n.so.67: cannot open shared object file: No such file or directory

Looks like 'icu' (from core) needs to be a dependency

GitSquared commented on 2020-04-18 21:37 (UTC)

@tyrannis.hawk Done, on both packages. Thanks for letting me know.

tyrannis.hawk commented on 2020-04-16 15:45 (UTC)

Same as with edex-ui-git, 'python' is a build dependency. Could you please add it?

peterjin0703 commented on 2020-02-27 01:22 (UTC)

This PKGBUILD fails to me... Here is the log:

> node-pty@0.8.1 install /home/sing/.cache/yay/edex-ui/src/edex-ui-2.2.2/prebuild-src/node_modules/node-pty
> node scripts/install.js

make: entering“/home/sing/.cache/yay/edex-ui/src/edex-ui-2.2.2/prebuild-src/node_modules/node-pty/build”
  CXX(target) Release/obj.target/pty/src/unix/pty.o
g++: error: unrecognized command line option '-fno-plt'
make: *** [pty.target.mk:101:Release/obj.target/pty/src/unix/pty.o] error code 1
make: leaving“/home/sing/.cache/yay/edex-ui/src/edex-ui-2.2.2/prebuild-src/node_modules/node-pty/build”
gyp ERR! build error 
gyp ERR! stack Error: `make` failed with exit code: 2
gyp ERR! stack     at ChildProcess.onExit (/usr/lib/node_modules/node-gyp/lib/build.js:194:23)
gyp ERR! stack     at ChildProcess.emit (events.js:198:13)
gyp ERR! stack     at Process.ChildProcess._handle.onexit (internal/child_process.js:248:12)
gyp ERR! System Linux 5.5.2-1-MANJARO
gyp ERR! command "/usr/bin/node" "/usr/lib/node_modules/node-gyp/bin/node-gyp.js" "rebuild"
gyp ERR! cwd /home/sing/.cache/yay/edex-ui/src/edex-ui-2.2.2/prebuild-src/node_modules/node-pty
gyp ERR! node -v v10.18.1
gyp ERR! node-gyp -v v6.1.0
gyp ERR! not ok 
npm WARN optional SKIPPING OPTIONAL DEPENDENCY: osx-temperature-sensor@1.0.3 (node_modules/osx-temperature-sensor):
npm WARN notsup SKIPPING OPTIONAL DEPENDENCY: Unsupported platform for osx-temperature-sensor@1.0.3: wanted {"os":"darwin","arch":"any"} (current: {"os":"linux","arch":"x64"})

npm ERR! code ELIFECYCLE
npm ERR! errno 1
npm ERR! node-pty@0.8.1 install: `node scripts/install.js`
npm ERR! Exit status 1
npm ERR! 
npm ERR! Failed at the node-pty@0.8.1 install script.
npm ERR! This is probably not a problem with npm. There is likely additional logging output above.

npm ERR! A complete log of this run can be found in:
npm ERR!     /home/sing/.npm/_logs/2020-02-27T01_20_57_679Z-debug.log
npm ERR! code ELIFECYCLE
npm ERR! errno 1
npm ERR! edex-ui@2.2.2 prebuild-linux: `rsync -a --info=progress2 src/ prebuild-src --exclude node_modules && node prebuild-minify.js && cd prebuild-src && npm install`
npm ERR! Exit status 1
npm ERR! 
npm ERR! Failed at the edex-ui@2.2.2 prebuild-linux script.
npm ERR! This is probably not a problem with npm. There is likely additional logging output above.

npm ERR! A complete log of this run can be found in:
npm ERR!     /home/sing/.npm/_logs/2020-02-27T01_20_58_030Z-debug.log

Anyone can help?

GitSquared commented on 2020-02-01 17:26 (UTC)

@chrisjbillington Good call - I thought it was bundled with node, turns out I was wrong. Added it to makedepends.

chrisjbillington commented on 2020-02-01 16:39 (UTC)

I don't seem to have an npm command at all - should npm be in makedepends? /usr/bin/npm is not provided by nodejs-lts-dubnium (not that I know whether it should be, I am an ignoramus about javascript/nodejs) .

/home/bilbo/.cache/yay/edex-ui/PKGBUILD: line 23: npm: command not found
==> ERROR: A failure occurred in build().
    Aborting...
Error making: edex-ui

GitSquared commented on 2020-02-01 15:41 (UTC)

@mcstayinskool I pushed a package update correctly linking to the latest supported Node version (LTS Dubnium) as a makedepend (commit 372d4df)

Note that if you're a Node developer you'll have to be extra careful that npm and/or node isn't aliased to some other version in your shell (disable nvm).

You might want to check out the edex-ui-git package which is some 400 commits ahead of the latest release. I currently have no ETA for when I'm going to be able to finish a new release as I missed a few deadlines already.

mcstayinskool commented on 2020-01-30 18:52 (UTC)

Broken with the identical error as @tyrannis.hawk

Not sure what you mean by using nodejs 8? Did you mean nodejs6-bin. If so, that fails to install for me due to conflicts with nodejs (which I'm loathe to uninstall because of its myriad other dependencies). If not, could you point us in the right direction?

GitSquared commented on 2020-01-16 15:20 (UTC)

@tyrannis.hawk Use nodejs 8.

tyrannis.hawk commented on 2020-01-16 14:55 (UTC) (edited on 2020-01-16 14:55 (UTC) by tyrannis.hawk)

This PKGBUILD is failing to build for me. This is the log:

0 info it worked if it ends with ok
1 verbose cli [ '/usr/bin/node', '/usr/bin/npm', 'run', 'prebuild-linux' ]
2 info using npm@6.13.4
3 info using node@v13.5.0
4 verbose run-script [ 'prebuild-linux' ]
5 info lifecycle edex-ui@2.2.2~prebuild-linux: edex-ui@2.2.2
6 verbose lifecycle edex-ui@2.2.2~prebuild-linux: unsafe-perm in lifecycle true
7 verbose lifecycle edex-ui@2.2.2~prebuild-linux: PATH: /usr/lib/node_modules/npm/node_modules/npm-lifecycle/node-gyp-bin:/tmp/makepkg/edex-ui/src/edex-ui-2.2.2/node_modules/.bin:/usr/lib/aurutils:/home/overlord/.local/bin:/usr/local/sbin:/usr/local/bin:/usr/bin:/usr/lib/jvm/default/bin:/usr/bin/site_perl:/usr/bin/vendor_perl:/usr/bin/core_perl
8 verbose lifecycle edex-ui@2.2.2~prebuild-linux: CWD: /tmp/makepkg/edex-ui/src/edex-ui-2.2.2
9 silly lifecycle edex-ui@2.2.2~prebuild-linux: Args: [
9 silly lifecycle   '-c',
9 silly lifecycle   'rsync -a --info=progress2 src/ prebuild-src --exclude node_modules && node prebuild-minify.js && cd prebuild-src && npm install'
9 silly lifecycle ]
10 silly lifecycle edex-ui@2.2.2~prebuild-linux: Returned: code: 1  signal: null
11 info lifecycle edex-ui@2.2.2~prebuild-linux: Failed to exec prebuild-linux script
12 verbose stack Error: edex-ui@2.2.2 prebuild-linux: `rsync -a --info=progress2 src/ prebuild-src --exclude node_modules && node prebuild-minify.js && cd prebuild-src && npm install`
12 verbose stack Exit status 1
12 verbose stack     at EventEmitter.<anonymous> (/usr/lib/node_modules/npm/node_modules/npm-lifecycle/index.js:332:16)
12 verbose stack     at EventEmitter.emit (events.js:305:20)
12 verbose stack     at ChildProcess.<anonymous> (/usr/lib/node_modules/npm/node_modules/npm-lifecycle/lib/spawn.js:55:14)
12 verbose stack     at ChildProcess.emit (events.js:305:20)
12 verbose stack     at maybeClose (internal/child_process.js:1028:16)
12 verbose stack     at Process.ChildProcess._handle.onexit (internal/child_process.js:286:5)
13 verbose pkgid edex-ui@2.2.2
14 verbose cwd /tmp/makepkg/edex-ui/src/edex-ui-2.2.2
15 verbose Linux 4.19.91-1-MANJARO
16 verbose argv "/usr/bin/node" "/usr/bin/npm" "run" "prebuild-linux"
17 verbose node v13.5.0
18 verbose npm  v6.13.4
19 error code ELIFECYCLE
20 error errno 1
21 error edex-ui@2.2.2 prebuild-linux: `rsync -a --info=progress2 src/ prebuild-src --exclude node_modules && node prebuild-minify.js && cd prebuild-src && npm install`
21 error Exit status 1
22 error Failed at the edex-ui@2.2.2 prebuild-linux script.
22 error This is probably not a problem with npm. There is likely additional logging output above.
23 verbose exit [ 1, true ]

chilledfrogs commented on 2019-11-20 14:25 (UTC)

Hello there,

A certain command, {:timestamp=>"2019-11-20T15:19:27.744350+0100", :message=>"Process failed: /usr/bin/fish failed (exit code 127). Full command was:[\"/usr/bin/fish\", \"-c\", \"LANG=C bsdtar -czf .MTREE --format=mtree --options='!all,use-set,type,uid,gid,mode,time,size,md5,sha256,link' .INSTALL .PKGINFO usr opt\"]", :level=>:error}, always insists on using my default shell, fish, even when I start the install from a bash shell... I'm not sure how to tell it to use bash for this...

chrisjbillington commented on 2019-03-01 18:58 (UTC) (edited on 2019-03-01 18:58 (UTC) by chrisjbillington)

@GitSquared you must be right, because now it's fine.

GitSquared commented on 2019-03-01 15:13 (UTC)

@chrisjbillington I changed the sha256 sum on this package because the upstream tarball was changed. You might be experiencing an issue with a cache still serving the old file.

chrisjbillington commented on 2019-03-01 05:00 (UTC)

It is not working for me. If I download the source archive v2.1.0.tar.gz, I see that its sha256 sum is the one starting with 48d6bc, i.e. before the change you made today in 2.1.0-2.

GitSquared commented on 2019-02-28 18:02 (UTC)

@michaldybczak Should have been updated in AUR package version v2.1.0-2 a few minutes ago. Is it still not working?

michaldybczak commented on 2019-02-28 17:56 (UTC)

sha256sums isn't a match in the version from today (28.02.2019). Please, fix the sha256sums.

srei81 commented on 2019-01-31 00:16 (UTC) (edited on 2019-01-31 00:16 (UTC) by srei81)

/tmp/pamac-build/edex-ui-git/src/edex-ui/node_modules/read-config-file/out/main.js:71 async function readConfig(configFile, request) { ^^^^^^^^

SyntaxError: Unexpected token function at createScript (vm.js:56:10) at Object.runInThisContext (vm.js:97:10) at Module._compile (module.js:549:28) at Object.Module._extensions..js (module.js:586:10) at Module.load (module.js:494:32) at tryModuleLoad (module.js:453:12) at Function.Module._load (module.js:445:3) at Module.require (module.js:504:17) at require (internal/module.js:20:19) at _readConfigFile (/tmp/pamac-build/edex-ui-git/src/edex-ui/node_modules/electron-builder/src/cli/cli.ts:10:1) at Object.args [as handler] (/tmp/pamac-build/edex-ui-git/src/edex-ui/node_modules/electron-builder/src/cli/cli.ts:45:5) at Object.runCommand (/tmp/pamac-build/edex-ui-git/src/edex-ui/node_modules/yargs/lib/command.js:238:44) at Object.parseArgs [as _parseArgs] (/tmp/pamac-build/edex-ui-git/src/edex-ui/node_modules/yargs/yargs.js:1089:24) at Object.get [as argv] (/tmp/pamac-build/edex-ui-git/src/edex-ui/node_modules/yargs/yargs.js:1004:21) at Object.<anonymous> (/tmp/pamac-build/edex-ui-git/src/edex-ui/node_modules/electron-builder/src/cli/cli.ts:19:1) at Module._compile (module.js:577:32) ==> FEHLER: Ein Fehler geschah in build().

icanwalkonwater commented on 2018-11-29 16:31 (UTC)

@ShayBox from what I can see, tar failed and the only reason I see right now is that one of the file in the command doesn't exists, can you manually build the package from the cache of yay with makepkg -sicCfL and give me the log file that it will have generated ?

IndomiTek commented on 2018-11-23 16:18 (UTC)

edex-ui: error while loading shared libraries: libgconf-2.so.4: cannot open shared object file: No such file or directory

Adding the dependency lib32-gconf resolved the issue on my system.