Package Details: extra-cmake-modules-git 5.83.0.r3302.001f901e-1

Git Clone URL: https://aur.archlinux.org/extra-cmake-modules-git.git (read-only, click to copy)
Package Base: extra-cmake-modules-git
Description: Extra modules and scripts for CMake
Upstream URL: https://projects.kde.org/projects/kdesupport/extra-cmake-modules
Keywords: extra-cmake-modules
Licenses: LGPL
Conflicts: extra-cmake-modules
Provides: extra-cmake-modules
Submitter: sl1pkn07
Maintainer: sl1pkn07
Last Packager: sl1pkn07
Votes: 34
Popularity: 0.095382
First Submitted: 2015-08-10 14:56
Last Updated: 2021-05-17 15:04

Required by (880)

Sources (1)

Latest Comments

1 2 Next › Last »

IslandC0der commented on 2021-07-07 01:17

Hey, could you please add this patch?

It fixes a very annoying issue many users are having, where they can't compile certain KDE apps if they have python2 installed.

IslandC0der commented on 2021-06-03 15:40

Hi :)

Please consider adding this patch, otherwise we get __init__.py conflicts with certain KDE packages

desaparecido commented on 2021-05-17 15:01

solved in upstream:

"Fix doc build with Sphinx 4" https://github.com/KDE/extra-cmake-modules/commit/001f901ee297bb5346729a02e8920b7528e20717

builds fine now without patch

malcolm commented on 2021-05-16 14:29

Thanks!

malcolm commented on 2021-05-15 15:29

Extension error:
exception: cannot import name 'htmlescape' from 'sphinx.util.pycompat' (/usr/lib/python3.9/site-packages/sphinx/util/pycompat.py)
make[2]: *** [docs/CMakeFiles/documentation.dir/build.make:75: docs/doc_format_html] Erro 2
make[1]: *** [CMakeFiles/Makefile2:98: docs/CMakeFiles/documentation.dir/all] Erro 2
make: *** [Makefile:144: all] Erro 2

micwoj92 commented on 2020-10-01 01:11

Shouldnt "python-requests" be in makedepends? it is in extra-cmake-modules since version 5.29

sl1pkn07 commented on 2016-07-25 15:35

Then update it(?)

Is a Git package, when reinstall is auroupdate iself

g99 commented on 2016-07-25 15:15

dolphin cannot be built with 5.22 anymore, needs 5.24

g99 commented on 2016-07-25 15:11

dolphin cannot be made with this old package

jimnotic commented on 2016-06-09 19:32

I was getting Python errors stating files already exists in site-packages/setuptools/, did the following to fix it:
pip uninstall setuptools