Package Details: falkon-git 3.1.99_r5703.g9bebc144-1

Git Clone URL: https://aur.archlinux.org/falkon-git.git (read-only, click to copy)
Package Base: falkon-git
Description: Cross-platform QtWebEngine browser
Upstream URL: https://www.falkon.org/
Licenses: GPL3
Conflicts: falkon
Provides: falkon
Replaces: qupzilla
Submitter: SolarAquarion
Maintainer: SolarAquarion (IslandC0der)
Last Packager: IslandC0der
Votes: 68
Popularity: 0.000000
First Submitted: 2017-09-06 03:26 (UTC)
Last Updated: 2021-06-03 21:44 (UTC)

Dependencies (15)

Required by (1)

Sources (1)

Latest Comments

1 2 3 4 5 6 .. 9 Next › Last »

Vencorr commented on 2022-04-09 10:38 (UTC)

This really doesn't need to depend on extra-cmake-modules-git, kio-git, or purpose-git and can be built just fine with the Arch package binaries.

francoism90 commented on 2021-02-20 20:29 (UTC)

Is Falkon still alive? It looks promising, but the last stable release was in 2019 and it seems development seems really slowly?

sfabius commented on 2019-06-03 14:49 (UTC) (edited on 2019-06-03 14:50 (UTC) by sfabius)

I'm getting the following build fail on multiple machines:

/usr/bin/shiboken2: error while loading shared libraries: libclang.so.7: cannot open shared object file: No such file or directory

make[2]: *** [src/plugins/PyFalkon/CMakeFiles/PyFalkon_autogen.dir/build.make:146: src/plugins/PyFalkon/PyFalkon/pyfalkon_module_wrapper.cpp] Error 127

make[1]: *** [CMakeFiles/Makefile2:1790: src/plugins/PyFalkon/CMakeFiles/PyFalkon_autogen.dir/all] Error 2

make: *** [Makefile:141: all] Error 2

==> ERROR: A failure occurred in build().

Aborting...

Error making: falkon-git

SGOrava commented on 2019-05-27 14:13 (UTC)

Hello, if the python support is enabled in this package I assume that the line

sed -i 's/set(ENABLE_PYTHON_PLUGINS TRUE)//' CMakeLists.txt

is a relic and should be commented or removed in some way. The purpose is to disable python support, which should be enabled by now.

Have a nice day.

muvori commented on 2018-11-03 22:42 (UTC)

you should probably change the upstream url to falkon.org as they ceased development on Qupzilla

elektromodulator commented on 2018-05-31 13:05 (UTC) (edited on 2018-05-31 13:05 (UTC) by elektromodulator)

Build fails on:

[ 70%] Building CXX object src/plugins/PyFalkon/CMakeFiles/PyFalkon.dir/PyFalkon/pyfalkon_module_wrapper.cpp.o

falkon-git/src/build/src/plugins/PyFalkon/PyFalkon/pyfalkon_module_wrapper.cpp:355:2: error: #error writeMinimalConstructorExpression: Could not find a minimal constructor for type 'QHstsPolicy'. This will result in a compilation error. #error writeMinimalConstructorExpression: Could not find a minimal constructor for type 'QHstsPolicy'. This will result in a compilation error.

keren_sky commented on 2018-05-26 02:26 (UTC) (edited on 2018-05-26 02:27 (UTC) by keren_sky)

Hai, could you modify the sources to git+https://anongit.kde.org/falkon.git My sucky ISP recently moved my landliine to a new package & now plain svn:// & git:// clones timeout. All ports blocked. Thnx!

SolarAquarion commented on 2018-05-14 22:05 (UTC)

@jeancf you need to update pyside2 and shiboken

jeancf commented on 2018-05-14 19:48 (UTC)

3.0.0.234.g3760a9ff-1 build fails with this as the most significant event at the 49% mark:

qt.shiboken: (pyfalkon) Can't find typesystem_webenginecore.xml, current path: /tmp/pamac-build-jeancf/falkon-git/src/falkon/src/plugins/PyFalkon, typesystem paths: /usr/share/PySide2/typesystems
Cannot parse file: /tmp/pamac-build-jeancf/falkon-git/src/falkon/src/plugins/PyFalkon/typesystem_pyfalkon.xmlshiboken: Error running ApiExtractor.