Package Details: far2l-git r2215.db8de613-1

Git Clone URL: https://aur.archlinux.org/far2l-git.git (read-only, click to copy)
Package Base: far2l-git
Description: Linux port of FAR v2
Upstream URL: https://github.com/elfmz/far2l
Licenses: GPL2
Submitter: mmozeiko
Maintainer: mmozeiko
Last Packager: mmozeiko
Votes: 15
Popularity: 0.38
First Submitted: 2016-12-14 00:40
Last Updated: 2021-04-23 03:33

Dependencies (16)

Required by (0)

Sources (4)

Latest Comments

1 2 Next › Last »

sirocco commented on 2021-04-27 09:16

There was the same error with atkmmconfig.h, when building via makepkg. Adding options=('!makeflags') to the PKGBUILD solved the problem.

mkoloberdin commented on 2021-04-23 20:59

@mmozeiko Indeed, it builds fine without the helper (aura). But it does not seem to be an aura issue. This is somewhat related: https://gitlab.kitware.com/cmake/cmake/-/issues/21627

mmozeiko commented on 2021-04-23 20:17

@mkoloberdin can you please try building without AUR helper to see if it builds then?

mkoloberdin commented on 2021-04-23 20:05

far2l-git r2215.db8de613-1

In file included from /usr/include/atkmm-1.6/atkmm/object.h:30,
                 from /usr/include/gtkmm-3.0/gtkmm/widget.h:35,
                 from /usr/include/gtkmm-3.0/gtkmm/action.h:31,
                 from /usr/include/gtkmm-3.0/gtkmm/toggleaction.h:29,
                 from /usr/include/gtkmm-3.0/gtkmm.h:108,
                 from /var/cache/aura/vcs/far2l-git/far2l-git/src/far2l/far-gvfs/src/GvfsService.h:7,
                 from /var/cache/aura/vcs/far2l-git/far2l-git/src/far2l/far-gvfs/src/GvfsService.cpp:7:
/usr/include/atkmm-1.6/atkmm/component.h:5:10: fatal error: atkmmconfig.h: No such file or directory
    5 | #include <atkmmconfig.h>
      |          ^~~~~~~~~~~~~~~
compilation terminated.
$ locate atkmmconfig.h
/usr/lib/atkmm-1.6/include/atkmmconfig.h

RodionD commented on 2021-04-23 06:42

Please add 'aarch64' into build script. I builded far2l from AUR on Manjaro on RaspberryPi4B and this works fine.

hopyres commented on 2021-04-22 04:43

Makepkg not create install packet patching file CMakeLists.txt Hunk #1 FAILED at 54. 1 out of 1 hunk FAILED -- saving rejects to file CMakeLists.txt.rej

mmozeiko commented on 2021-02-21 01:03

@hopyres there's nothing to update. It builds fine. Remove previous build artifacts and do the build in clean space. Also which checksum is wrong? Both patch files have correct sha256.

hopyres commented on 2021-02-19 07:57

Please update file PKGBUILD for new version. Makepkg end with error on file far2l-desktop.patch. I'm used command 'updpkgsums' for update checksum for correct this problem.

olegmaltzev commented on 2020-05-18 20:40

Yes, it works now, thanks!

mmozeiko commented on 2020-05-17 08:06

@olegmaltzev build should be fixed now. Needed to use latest far-gvfs commit.

Also now it's possible to use OpenSSL v1.1, no need for v1.0 anymore.