Package Details: file-commander-git 0.9.4.8.r1.g9847b08-1

Git Clone URL: https://aur.archlinux.org/file-commander-git.git (read-only)
Package Base: file-commander-git
Description: Qt-based cross-platform Total Commander-like orthodox file manager for Windows, Mac and Linux
Upstream URL: https://github.com/VioletGiraffe/file-commander
Licenses: GPL3
Submitter: SolarAquarion
Maintainer: SolarAquarion
Last Packager: SolarAquarion
Votes: 1
Popularity: 0.010080
First Submitted: 2017-07-02 03:03
Last Updated: 2018-08-27 11:16

Latest Comments

yochananmarqos commented on 2019-10-03 01:43

This currently doesn't build, might be an upstream issue:

threading/cworkerthread.cpp: In constructor ‘CWorkerThreadPool::CWorkerThreadPool(size_t, std::string)’:
threading/cworkerthread.cpp:84:102: error: ‘std::basic_ostream<char>::__ostream_type’ {aka ‘class std::basic_ostream<char>’} has no member named ‘str’
   84 |   _workerThreads.emplace_back(_queue, (std::ostringstream{} << _poolName << " worker thread #" << i).str()).start();
      |                                                                                                      ^~~
At global scope:
cc1plus: warning: unrecognized command line option ‘-Wno-deprecated-register’
cc1plus: warning: unrecognized command line option ‘-Wno-local-type-template-args’
cc1plus: warning: unrecognized command line option ‘-Wno-c++11-extensions’
make[1]: *** [Makefile:609: ../build/release/x64/cpputils/cworkerthread.o] Error 1
make[1]: *** Waiting for unfinished jobs....
make[1]: Leaving directory '/home/yochanan/Documents/pkgbuilds/file-commander-git/src/file-commander/cpputils'
make: *** [Makefile:188: sub-cpputils-make_first] Error 2
==> ERROR: A failure occurred in build().
    Aborting...