Package Details: fim 0.6-3

Git Clone URL: https://aur.archlinux.org/fim.git (read-only, click to copy)
Package Base: fim
Description: FIM (Fbi IMproved) is a highly customizable and scriptable image viewer.
Upstream URL: https://www.nongnu.org/fbi-improved/
Licenses: GPL2
Conflicts: fim-svn
Submitter: Dragonlord
Maintainer: meanjollies
Last Packager: meanjollies
Votes: 26
Popularity: 0.59
First Submitted: 2008-02-27 17:02
Last Updated: 2020-07-23 05:21

Latest Comments

« First ‹ Previous 1 2 3 4 5 Next › Last »

meanjollies commented on 2020-05-05 16:07

sed -i 's/configure/configure LIBS=-lpthread/' PKGBUILD, then try to build it manually.

Also, is this being built on some non-x86 architecture?

emk2203 commented on 2020-05-05 15:35

I added the option -lpthread both to CFLAGS and CXXFLAGS. Program compiles and installs. The user needs to be added to the video group besides setting the font path in .bash_profile.

Unchanged, it works in the tty, but under X you get:

ioctl VT_GETSTATE: Inappropriate ioctl for device (not a linux console?) ioctl VT_GETSTATE: Inappropriate ioctl for device

Same with sudo fim.

X support is not the default, a bit unexpected. For fim to work under X, the option --enable-sdl needs to be added in the ./configure part in PKGBUILD and the dependency sdl downloaded. After all this, fim works well under X and with the tty.

meanjollies commented on 2020-05-05 12:21

What libraries does LIBS include? It should include -lpthread, but if it does not, can you let me know if adding LIBS=-lpthread to the PKGBUILD's ./configure options works? Unfortunately, I can't reproduce this, so your help is appreciated.

emk2203 commented on 2020-05-05 11:41

Doesn't compile. Error message:

/usr/bin/ld: Browser.o: undefined reference to symbol 'pthread_create@@GLIBC_2.2.5' /usr/bin/ld: /usr/lib/libpthread.so.0: error adding symbols: DSO missing from command line

I tried adding '-std=c++11 -pthread' to the CXX_FLAGS declaration in the Makefile, but that didn't help. Update would be appreciated.

Danieldakataca commented on 2020-04-14 20:44

Error en la compilación del paquete!

oriba commented on 2019-06-06 14:14

Please update the package. Also, please add the font-dependency: package 'terminus-font' is needed.

bartus commented on 2019-04-04 13:09

libexif missing form depends

basedtho commented on 2016-11-08 02:02

Please add libexif to the dependencies

Although it doesn't compile even if I install libexif, it shows the following error message:

g++ -DHAVE_CONFIG_H -I. -I.. -march=x86-64 -mtune=generic -O2 -pipe -fstack-protector-strong -c -o CommandConsole-init.o CommandConsole-init.cpp
CommandConsole-init.cpp: In member function ‘fim_err_t fim::CommandConsole::init(fim::string)’:
CommandConsole-init.cpp:258:17: error: ‘FIM_WITH_LIBSDL’ was not declared in this scope
|| device==FIM_WITH_LIBSDL
^~~~~~~~~~~~~~~
make[4]: *** [Makefile:780: CommandConsole-init.o] Error 1
make[4]: Leaving directory '/home/budkin/.cache/pacaur/fim/src/fim-0.5-rc2/src'
make[3]: *** [Makefile:813: all-recursive] Error 1
make[3]: Leaving directory '/home/budkin/.cache/pacaur/fim/src/fim-0.5-rc2/src'
make[2]: *** [Makefile:441: all] Error 2
make[2]: Leaving directory '/home/budkin/.cache/pacaur/fim/src/fim-0.5-rc2/src'
make[1]: *** [Makefile:435: all-recursive] Error 1
make[1]: Leaving directory '/home/budkin/.cache/pacaur/fim/src/fim-0.5-rc2'
make: *** [Makefile:346: all] Error 2
==> ERROR: A failure occurred in build().
Aborting...
:: failed to build fim package(s)

anntzer commented on 2016-07-07 18:55

Regarding the message

==> To get fim to work after you've installed it, place the following export in
==> your ~/.profile file:
==>
==> export FBFONT=/usr/share/kbd/consolefonts/ter-216n.psf.gz

This font is not provided by the package, and setting FBFONT as suggested results in the error message:

font "/usr/share/kbd/consolefonts/ter-216n.psf.gz" is not available

stevenhoneyman commented on 2014-10-11 16:49

flex and bison are both in base-devel.

"Warning: Packages in the AUR assume the base-devel group is installed, and AUR packages will not list members of this group as dependencies even if the package cannot be built without them. Please ensure this group is installed before complaining about failed builds." - Arch wiki