Package Details: firefox-esr-gtk2 52.8.0-1

Git Clone URL: https://aur.archlinux.org/firefox-esr-gtk2.git (read-only)
Package Base: firefox-esr-gtk2
Description: Standalone web browser from mozilla.org, Extended Support Release
Upstream URL: https://www.mozilla.org/en-US/firefox/organizations/
Keywords: browser gecko web
Licenses: GPL, MPL, LGPL
Conflicts: firefox
Provides: firefox=52.8.0
Replaces: firefox-gtk2
Submitter: Case_Of
Maintainer: Case_Of (bidulock)
Last Packager: Case_Of
Votes: 46
Popularity: 0.005842
First Submitted: 2017-04-21 23:12
Last Updated: 2018-05-09 21:49

Dependencies (31)

Required by (205)

Sources (10)

Latest Comments

Case_Of commented on 2018-05-09 22:22

Happily, Mozilla still support ESR 52, so here is 52.8.

Case_Of commented on 2018-03-16 21:46

No new i686 builds will be hosted on my server.

Case_Of commented on 2018-02-25 22:34

@kachelaqa: I'll upload a rebuild for these, until you can make a symlink for changed sonames.

kachelaqa commented on 2018-02-25 04:05

@Case_Of. I am a very grateful user of your firefox-esr-gtk2 and thunderbird-gtk2 binary packages, as my system is now too old to build them from source (overheating problems). The current packages depend on libvpx.so=4-64, and won't work with libvpx.so=5-64, so are in need of a re-build. Do you have any plans to do this? Sorry if I seem impatient, but not being able to upgrade libvpx is starting to cause me quite a few problems.

Case_Of commented on 2017-10-20 03:50

It is now fixed, sorry for the long wait and all inconviences caused by this.
My connections issues were longer than expected.

Techman35 commented on 2017-10-05 00:45

Case_of plis upload the update T.T

Case_Of commented on 2017-10-04 11:39

@bidulock: Hi, I'm having connection issues currently, I will be able to investigate on it next week.

bidulock commented on 2017-10-04 09:07

Won't build. I get:

==> Retrieving sources...
-> Found firefox-52.4.0esr.source.tar.xz
-> Found firefox.desktop
-> Found firefox-symbolic.svg
-> Found 0001-Bug-54395-remove-hardcoded-flag-lcrmf.patch
-> Found firefox-install-dir.patch
-> Found fix-wifi-scanner.diff
-> Found glibc-2.26-fix.diff
-> Found rust-i686.patch
-> Found make_SystemResourceMonitor.stop_more_resilient_to_errors.patch
==> WARNING: Skipping all source file integrity checks.
==> Extracting sources...
-> Extracting firefox-52.4.0esr.source.tar.xz with bsdtar
==> Starting prepare()...
patching file config/baseconfig.mk
Hunk #1 succeeded at 4 with fuzz 2.
patching file netwerk/wifi/nsWifiScannerDBus.cpp
patching file old-configure.in
patching file security/manager/ssl/moz.build
patching file linux/dump_writer_common/ucontext_reader.cc
patching file linux/dump_writer_common/ucontext_reader.h
patching file linux/handler/exception_handler.cc
patching file linux/handler/exception_handler.h
patching file linux/microdump_writer/microdump_writer.cc
patching file linux/minidump_writer/minidump_writer.cc
patching file build/moz.configure/rust.configure
Hunk #1 succeeded at 105 (offset 24 lines).
patching file testing/mozbase/mozsystemmonitor/mozsystemmonitor/resourcemonitor.py
==> Starting build()...
Your tree has not been configured yet. Please run |mach build| with no arguments.
==> ERROR: A failure occurred in build().
Aborting...
==> ERROR: Build failed, check /u8/aur/64/brian/build

Alad commented on 2017-09-28 21:04

Regarding gcc63: note that this package was merged into gcc6.

eerie commented on 2017-08-26 10:54

I have gcc (GCC) 7.1.1 20170630 installed.
Since gcc63 is needed to build firefox-esr-gtk2, I'm trying to install it, but the build fails:
[..]
ranlib: $HOME/COWER_PACKAGES/firefox-esr-gtk2_Aug_2017/gcc63/src/gcc-4ca53f06ff7d346ef8021a23108f23a5406a0417/gcc-build/./gcc/libgcc_s.so.1: version `GCC_7.0.0' not found (required by /usr/lib/libLLVM-4.0.so)
make[4]: *** [Makefile:1126: install-leaf] Segmentation fault (core dumped)
make[4]: Leaving directory '$HOME/COWER_PACKAGES/firefox-esr-gtk2_Aug_2017/gcc63/src/gcc-4ca53f06ff7d346ef8021a23108f23a5406a0417/gcc-build/i686-pc-linux-gnu/libgcc'
make[3]: *** [Makefile:113: all] Error 2
make[3]: Leaving directory '$HOME/COWER_PACKAGES/firefox-esr-gtk2_Aug_2017/gcc63/src/gcc-4ca53f06ff7d346ef8021a23108f23a5406a0417/gcc-build/i686-pc-linux-gnu/libgcc'
make[2]: *** [Makefile:18054: all-stage1-target-libgcc] Error 2
make[2]: Leaving directory '$HOME/COWER_PACKAGES/firefox-esr-gtk2_Aug_2017/gcc63/src/gcc-4ca53f06ff7d346ef8021a23108f23a5406a0417/gcc-build'
make[1]: *** [Makefile:25049: stage1-bubble] Error 2
make[1]: Leaving directory '$HOME/COWER_PACKAGES/firefox-esr-gtk2_Aug_2017/gcc63/src/gcc-4ca53f06ff7d346ef8021a23108f23a5406a0417/gcc-build'
make: *** [Makefile:916: all] Error 2
==> ERROR: A failure occurred in build().
Aborting...

All comments