Package Details: firefox-wayland-hg r510977.4470bbd6ad9d-1

Git Clone URL: https://aur.archlinux.org/firefox-wayland-hg.git (read-only)
Package Base: firefox-wayland-hg
Description: Standalone web browser from mozilla.org - Wayland build of mozilla-unified hg
Upstream URL: https://www.mozilla.org/firefox/
Keywords: firefox hg lto pgo wayland
Licenses: GPL, MPL, LGPL
Conflicts: firefox
Provides: firefox
Submitter: onny
Maintainer: Ranguvar
Last Packager: Ranguvar
Votes: 11
Popularity: 0.409192
First Submitted: 2018-03-09 15:10
Last Updated: 2019-02-07 01:35

Dependencies (40)

Required by (216)

Sources (3)

Latest Comments

1 2 3 Next › Last »

Ranguvar commented on 2019-02-06 16:00

Adding build dep for nasm.

xenu commented on 2019-01-19 00:22

There were two issues:

After those two changes the build works again.

Ranguvar commented on 2019-01-17 19:53

Sorry but I cannot reproduce this. Just successfully built again.

xenu commented on 2019-01-17 14:58

Hi, here is a full log of the failing build: https://pastebin.com/bEwgPnsP

Here I tried using makepgk directly in case my aur helper pikaur was getting in the way. Same error though.

Ranguvar commented on 2019-01-16 18:37

What rev are you building? Check the beginning of the build log.

Please pastebin the entire build log, yours does not include enough.

I build with no issue.

xenu commented on 2019-01-16 12:01

Ever since the latest update (2019-01-09 - r506165.89ca00a3e307) I get an error:

...

73:16.29 toolkit/library/symverscript.stub

73:16.29 make[5]: *** No rule to make target '../../media/libdav1d/asm/config.i_o', needed by 'libxul.so'. Stop.

73:16.29 make[5]: *** Waiting for unfinished jobs....

73:16.46 make[4]: *** [/home/user/.cache/pikaur/build/firefox-wayland-hg/src /mozilla-unified/config/recurse.mk:74: toolkit/library/target] Error 2

73:16.46 make[3]: *** [/home/user/.cache/pikaur/build/firefox-wayland-hg/src/mozilla-unified/config/recurse.mk:34: compile] Error 2

73:16.46 make[2]: *** [/home/user/.cache/pikaur/build/firefox-wayland-hg/src/mozilla-unified/config/rules.mk:415: default] Error 2

73:16.46 make[1]: *** [Makefile:192: profiledbuild] Error 2

73:16.46 make: *** [client.mk:125: build] Error 2

73:16.49 108 compiler warnings present.

==> ERROR: A failure occurred in build().

Aborting...

Ranguvar commented on 2019-01-09 21:45

Built latest with no issue.

Ranguvar commented on 2019-01-09 17:22

kubrick,

Can you please provide a full log? Upload to a pastebin.

kubrick commented on 2019-01-08 09:32

Hi,

For the past couple of weeks, I've been unable to update firefox with this PKGBUILD.

I always get

[...]

45:36.51 Making langpack

45:36.90 toolkit/locales/update.locale.stub

45:38.01 browser/locales/bookmarks.html.stub

45:39.62 Firefox exited with code 1 during profile initialization

45:39.65 make[1]: *** [Makefile:199: profiledbuild] Error 1

45:39.65 make: *** [client.mk:125: build] Error 2

[...]

Can you help?

Ranguvar commented on 2018-12-20 05:51

I also seem to require xorg-server-xwayland to start Firefox, while using sway.

GDK_BACKEND=wayland did not help.

I think Firefox still requires some XWayland, and we're enabling it correctly, but I could be wrong.

Anyways, updating to ~65.0b6, now with the same LTO/PGO from [extra].

If you don't like the extra compile time, delete the PKGBUILD lines I reference in a comment.