Package Details: flite 2.0.0-2

Git Clone URL: https://aur.archlinux.org/flite.git (read-only)
Package Base: flite
Description: A lighweight speech synthesis engine (text to speech)
Upstream URL: http://cmuflite.org
Licenses: custom
Submitter: ilpianista
Maintainer: stevenhoneyman
Last Packager: stevenhoneyman
Votes: 22
Popularity: 0.160126
First Submitted: 2010-11-13 14:55
Last Updated: 2015-06-09 18:11

Dependencies (1)

Required by (10)

Sources (1)

Latest Comments

wdiz commented on 2016-10-13 08:37

Same here, had to compile with makepkg -ci

Kakashi-sensei commented on 2016-09-19 02:14

So since this is irritating, could the maintainer please fix this?

travnick commented on 2016-07-30 09:16

same here

ronoverdrive commented on 2016-07-09 02:19

Same problem here, doesn't compile in Yaourt but does compile with makepkg -ci.

unknown78 commented on 2016-07-03 09:10

makepkg -ci worked. Thats strange.

darie commented on 2016-07-02 20:46

@unknown78 works here without error - not using yaourt though. Just plain makepkg -ci

unknown78 commented on 2016-07-02 14:08

i got an error when compiling -> http://pastebin.com/KeHPipaJ

stevenhoneyman commented on 2016-06-30 16:51

No, it's fine...

wget -q http://festvox.org/flite/packed/flite-2.0/flite-2.0.0-release.tar.bz2 -O - | md5sum
645db96ffc296cbb6d37f231cc1cc6b2 -

Mocha_Bean commented on 2016-06-29 21:06

No, it's broken again.

stevenhoneyman commented on 2016-06-29 16:40

Must have been temporary - source link works fine now.

epitron commented on 2016-06-29 05:31

You can use this mirror, for the time being: http://download.sipxcom.org/pub/sipXecs/libs/flite-2.0.0-release.tar.bz2

kalimerox commented on 2016-06-28 20:39

Hi there,
when i try building flite I get this:

% Total % Received % Xferd Average Speed Time Time Time Current
Dload Upload Total Spent Left Speed
0 0 0 0 0 0 0 0 --:--:-- --:--:-- --:--:-- 0Warning: Transient problem: timeout Will retry in 3 seconds. 3 retries left.
0 0 0 0 0 0 0 0 --:--:-- --:--:-- --:--:-- 0Warning: Transient problem: timeout Will retry in 3 seconds. 2 retries left.
0 0 0 0 0 0 0 0 --:--:-- --:--:-- --:--:-- 0Warning: Transient problem: timeout Will retry in 3 seconds. 1 retries left.
0 0 0 0 0 0 0 0 --:--:-- --:--:-- --:--:-- 0curl: (6) Could not resolve host: festvox.org
==> ERROR: Failure while downloading http://festvox.org/flite/packed/flite-2.0/flite-2.0.0-release.tar.bz2
Aborting...


is the server down?

stevenhoneyman commented on 2016-04-01 12:34

The "fix" breaks compilation with the official makepkg. I think this is a yaourt bug but I'm willing to add a workaround as long as it works for both.

kikislater commented on 2016-04-01 08:09

Hi,
Pupizoid's fix also worked for me. I am using yaourt

Please update PKGBUILD

thoth commented on 2016-03-22 14:30

OK, scratch my previous comment, makepkg -sri does indeed finish without error, but using what it makes does not appear to work with anything that I'm doing, specifially compiling apm_planner fails

for now best stick to compiling yourself

cd flite-2.0.0-release/
./configure
make
sudo make install

and everything works fine

thoth commented on 2016-03-21 22:35

I can confirm that this does not work in yaourt, but does if you download the tarball and `makeppkg -sri`, so what is going wrong with yaourt?

hemant_ng commented on 2016-02-15 18:11

Pupizoid's fix also worked for me. I am using yaourt.

mr_337 commented on 2016-02-10 07:06

Pupizoid's fix also worked for me. I am using yaourt.

Also any chance to be able to add 'cmu_us_kal' for easy install of apm_planner pkg?

stevenhoneyman commented on 2015-12-19 11:36

This still builds fine using makepkg, are you both using 'yaourt' by any chance?

hemant_ng commented on 2015-12-19 11:08

Pupizoid's fix got flite installed and it works with its 2 voices kal16 and slt. I did not change alsa or pulseaudio. Can the maintainer please update the PKGBUILD.

Pupizoid commented on 2015-12-15 19:10

Something wrong with variables and paths. I solved it by adding
sed -i '111s/..\/..\/..\///g' config/common_make_rules
sed -i '116s/..\/..\/..\///g' config/common_make_rules
sed -i '125s/..\///g' config/common_make_rules
sed -i '126s/..\///g' config/common_make_rules

in prepare section of PKGBUILD :)

awgneo commented on 2015-11-12 05:49

mikhailnov still getting hemant_ng's errors even after changing the PKGBUILD.

making in ...
making in include ...
making in src ...
making in src/audio ...
gcc -fPIC -I. -DCST_AUDIO_PULSEAUDIO -I../../include -g -O2 -Wall -c auclient.c -o /tmp/yaourt-tmp-awgneo/aur-flite/obj/src/audio/auclient.os
gcc -fPIC -I. -DCST_AUDIO_PULSEAUDIO -I../../include -g -O2 -Wall -c auserver.c -o /tmp/yaourt-tmp-awgneo/aur-flite/obj/src/audio/auserver.os
gcc -fPIC -I. -DCST_AUDIO_PULSEAUDIO -I../../include -g -O2 -Wall -c audio.c -o /tmp/yaourt-tmp-awgneo/aur-flite/obj/src/audio/audio.os
gcc -fPIC -I. -DCST_AUDIO_PULSEAUDIO -I../../include -g -O2 -Wall -c au_streaming.c -o /tmp/yaourt-tmp-awgneo/aur-flite/obj/src/audio/au_streaming.os
gcc -fPIC -I. -DCST_AUDIO_PULSEAUDIO -I../../include -g -O2 -Wall -c au_pulseaudio.c -o /tmp/yaourt-tmp-awgneo/aur-flite/obj/src/audio/au_pulseaudio.os
ar: `u' modifier ignored since `D' is the default (see `U')
ar: ../../..//tmp/yaourt-tmp-awgneo/aur-flite/lib/libflite.shared.a: No such file or directory
../../config/common_make_rules:116: recipe for target '/tmp/yaourt-tmp-awgneo/aur-flite/obj/src/audio/.build_so' failed
make[2]: *** [/tmp/yaourt-tmp-awgneo/aur-flite/obj/src/audio/.build_so] Error 1
../config/common_make_rules:132: recipe for target '/tmp/yaourt-tmp-awgneo/aur-flite/obj/src/.make_build_dirs' failed
make[1]: *** [/tmp/yaourt-tmp-awgneo/aur-flite/obj/src/.make_build_dirs] Error 2
config/common_make_rules:132: recipe for target '/tmp/yaourt-tmp-awgneo/aur-flite/obj//.make_build_dirs' failed
make: *** [/tmp/yaourt-tmp-awgneo/aur-flite/obj//.make_build_dirs] Error 2
==> ERROR: A failure occurred in build().
Aborting...
==> ERROR: Makepkg was unable to build flite.
==> Restart building flite ? [y/N]
==> ------------------------------
==>

mikhailnov commented on 2015-10-30 20:30

I solved it by changing
--with-audio=alsa
to
--with-audio=pulseaudio

in PKGBUILD. I have Pulseaudio installed.

mikhailnov commented on 2015-10-30 20:15

I get the same error as hemant_ng

hemant_ng commented on 2015-07-16 07:08

With command " yaourt -S flite" I keep getting this error. I have alsa-lib and multilib/lib32-alsa-lib installed.

making in ...
making in include ...
making in src ...
gcc -fPIC -I. -DCST_AUDIO_ALSA -I../../include -g -O2 -Wall -c auclient.c -o /tmp/makepkg/obj/src/audio/auclient.os
gcc -fPIC -I. -DCST_AUDIO_ALSA -I../../include -g -O2 -Wall -c auserver.c -o /tmp/makepkg/obj/src/audio/auserver.os
making in src/audio ...
gcc -fPIC -I. -DCST_AUDIO_ALSA -I../../include -g -O2 -Wall -c audio.c -o /tmp/makepkg/obj/src/audio/audio.os
gcc -fPIC -I. -DCST_AUDIO_ALSA -I../../include -g -O2 -Wall -c au_streaming.c -o /tmp/makepkg/obj/src/audio/au_streaming.os
gcc -fPIC -I. -DCST_AUDIO_ALSA -I../../include -g -O2 -Wall -c au_alsa.c -o /tmp/makepkg/obj/src/audio/au_alsa.os
gcc -I. -DCST_AUDIO_ALSA -I../../include -g -O2 -Wall -c auclient.c -o /tmp/makepkg/obj/src/audio/auclient.o
gcc -I. -DCST_AUDIO_ALSA -I../../include -g -O2 -Wall -c auserver.c -o /tmp/makepkg/obj/src/audio/auserver.o
gcc -I. -DCST_AUDIO_ALSA -I../../include -g -O2 -Wall -c audio.c -o /tmp/makepkg/obj/src/audio/audio.o
gcc -I. -DCST_AUDIO_ALSA -I../../include -g -O2 -Wall -c au_streaming.c -o /tmp/makepkg/obj/src/audio/au_streaming.o
gcc -I. -DCST_AUDIO_ALSA -I../../include -g -O2 -Wall -c au_alsa.c -o /tmp/makepkg/obj/src/audio/au_alsa.o
ar: ../../..//tmp/makepkg/lib/libflite.shared.a: No such file or directory
../../config/common_make_rules:116: recipe for target '/tmp/makepkg/obj/src/audio/.build_so' failed
make[2]: *** [/tmp/makepkg/obj/src/audio/.build_so] Error 1
make[2]: *** Waiting for unfinished jobs....
../config/common_make_rules:132: recipe for target '/tmp/makepkg/obj/src/.make_build_dirs' failed
make[1]: *** [/tmp/makepkg/obj/src/.make_build_dirs] Error 2
config/common_make_rules:132: recipe for target '/tmp/makepkg/obj//.make_build_dirs' failed
make: *** [/tmp/makepkg/obj//.make_build_dirs] Error 2
==> ERROR: A failure occurred in build().
Aborting...
==> ERROR: Makepkg was unable to build flite.
==> Restart building flite ? [y/N]
==> ------------------------------
==>

Holzhaus commented on 2015-01-12 18:06

There's a bug in the PKGBUILD.

To make it work, you need to change the source folder:
- cd "${srcdir}/${pkgname}-${pkgver}-current"
+ cd "${srcdir}/${pkgname}-${pkgver}-release"

stevenhoneyman commented on 2015-01-04 11:43

Updated, thanks.

Alister.Hood commented on 2015-01-04 09:49

Version 2 is available.

alexod commented on 2014-10-02 03:01

Actually I did reboot and it still fails if I try to build it using yaourt.
I do not have any idea what does cause this but I guess it is some variable yaourt sets or something like this.

stevenhoneyman commented on 2014-10-01 16:36

Glad to hear :)
I think it was probably using files from the previous failed build. Did you reboot some time between it being broken in yaourt, and when it was working in yaourt?

alexod commented on 2014-10-01 12:54

I meant by "building by hand" ./configure and make after applying the patches from your PKGBUILD.
Also I tried now to build the PKGBUILD using makepkg directly which works fine.

I guess then yaourt is the problem...

stevenhoneyman commented on 2014-10-01 00:58

When you say "building by hand" - do you mean manually running ./configure and make... or still using this PKGBUILD, but using 'makepkg' instead of yaourt?

alexod commented on 2014-10-01 00:49

With the new package I keep getting this error

checking mmsystem.h presence... no
checking for mmsystem.h... no
configure: creating ./config.status
config.status: creating config/config
config.status: creating config/system.mak
making in ...
making in include ...
making in src ...
making in src/audio ...
ar: ../../..//tmp/yaourt-tmp-alex/aur-flite/lib/libflite.shared.a: No such file or directory
../../config/common_make_rules:116: recipe for target '/tmp/yaourt-tmp-alex/aur-flite/obj/src/audio/.build_so' failed
make[2]: *** [/tmp/yaourt-tmp-alex/aur-flite/obj/src/audio/.build_so] Error 1
../config/common_make_rules:132: recipe for target '/tmp/yaourt-tmp-alex/aur-flite/obj/src/.make_build_dirs' failed
make[1]: *** [/tmp/yaourt-tmp-alex/aur-flite/obj/src/.make_build_dirs] Error 2
config/common_make_rules:132: recipe for target '/tmp/yaourt-tmp-alex/aur-flite/obj//.make_build_dirs' failed
make: *** [/tmp/yaourt-tmp-alex/aur-flite/obj//.make_build_dirs] Error 2

Building by hand works fine. Do you know what this might be?
Thank you for building this package.

stevenhoneyman commented on 2014-09-30 02:08

fixed. bit of a strange move by upstream to change things but keep the version number the same...

destbr commented on 2014-09-07 20:51

I got the error 'One or more files did not pass the validity check!'.

I changed the PKGBUILD file to skip the checksum of flite-1.9.0-current.tar.bz2 and I got the error below:

flite_voice_list.o: In function `flite_set_voice_list':
/home/bruno/Downloads/flite/flite/src/flite-1.9.0-current/main/flite_voice_list.c:13: undefined reference to `register_cmu_indic_lex'
collect2: error: ld returned 1 exit status
Makefile:93: recipe for target '../bin/flite' failed
make[1]: *** [../bin/flite] Error 1
config/common_make_rules:132: recipe for target 'build/x86_64-linux-gnu/obj//.make_build_dirs' failed
make: *** [build/x86_64-linux-gnu/obj//.make_build_dirs] Error 2
==> ERROR: A failure occurred in build().
Aborting...

What I have to do?

Thanks.

test0 commented on 2014-07-28 01:03

Fails to build with yaourt. Builds fine with makepkg.

test0 commented on 2014-07-28 00:54

This fails on x86_64 with

gcc -fPIC -I. -DCST_AUDIO_ALSA -I../../include -g -O2 -Wall -c au_alsa.c -o /tmp/yaourt-tmp-user/aur-flite/obj/src/audio/au_alsa.os
ar: ../../..//tmp/yaourt-tmp-user/aur-flite/lib/libflite.shared.a: No such file or directory
../../config/common_make_rules:116: recipe for target '/tmp/yaourt-tmp-user/aur-flite/obj/src/audio/.build_so' failed
make[2]: *** [/tmp/yaourt-tmp-user/aur-flite/obj/src/audio/.build_so] Error 1
../config/common_make_rules:132: recipe for target '/tmp/yaourt-tmp-user/aur-flite/obj/src/.make_build_dirs' failed
make[1]: *** [/tmp/yaourt-tmp-user/aur-flite/obj/src/.make_build_dirs] Error 2
config/common_make_rules:132: recipe for target '/tmp/yaourt-tmp-user/aur-flite/obj//.make_build_dirs' failed
make: *** [/tmp/yaourt-tmp-user/aur-flite/obj//.make_build_dirs] Error 2

stevenhoneyman commented on 2014-06-01 17:02

Adopted and updated (1.4 -> 1.9.0!)

stevenhoneyman commented on 2014-06-01 08:48

Adopted. Will fix the PKGBUILD later today as it currently doesn't compile!

tritron commented on 2012-12-26 15:40

can you add --enable-shared to you PKBUILD

der_fenix commented on 2012-02-23 13:49

If got error while making - switch MAKEFLAGS to -j1 in /etc/makepkg.conf and restart
MAKEFLAGS="-j1"

der_fenix commented on 2012-02-23 13:28

If got error while making - switch MAKEFLAGS to -j1 in /etc/makepkg.conf and restart
MAKEFLAGS="-j1"

ilpianista commented on 2010-11-13 14:55

* moved from [extra]