Package Details: foo2zjs 20161004-2

Git Clone URL: (read-only)
Package Base: foo2zjs
Description: foo2zjs Printer Drivers. Includes also foo2hp, foo2hbpl, foo2oak, foo2xqx, foo2qpdl, foo2slx, foo2hiperc and foo2lava drivers.
Upstream URL:
Licenses: GPL, custom
Conflicts: foo2zjs-testing
Submitter: dront78
Maintainer: intelfx
Last Packager: intelfx
Votes: 12
Popularity: 0.891442
First Submitted: 2015-10-10 16:48
Last Updated: 2016-10-05 05:50

Dependencies (7)

Required by (0)

Sources (8)

  • compile-flags-20161004-1.patch
  • destdir-support-20140329-1.patch
  • firmware-loader-20130602-1.patch
  • foo2zjs-20161004.tar.gz
  • gen-fixes-20140329-1.patch
  • make-ppd-20161003-2.patch
  • skip-foomatic-db-20161003-1.patch
  • udev-firmware-loading-ruleset-20130601-1.patch

Pinned Comments

intelfx commented on 2016-10-04 06:21

From now on, foo2zjs is decoupled from foomatic-db and does not require using the patched foomatic-db-foo2zjs package (nor does it require foomatic-db at all).

Latest Comments

intelfx commented on 2016-10-20 23:48

@RicardoScar: it doesn't fail here. Try to clean the build directory and re-download the sources (including the AUR tarball with PKGBUILD and all the patches).

RicardoScar commented on 2016-10-20 23:45

It is failing here with this output, is there anything I can do?

==> Iniciando prepare()...
patching file Makefile
Hunk #3 succeeded at 655 (offset 2 lines).
Hunk #4 succeeded at 709 (offset 2 lines).
Hunk #5 succeeded at 842 (offset 2 lines).
Hunk #6 succeeded at 902 (offset 2 lines).
Hunk #7 succeeded at 928 (offset 2 lines).
patching file Makefile
Hunk #1 succeeded at 383 (offset 2 lines).
Hunk #2 succeeded at 554 (offset -7 lines).
Hunk #3 succeeded at 769 (offset -7 lines).
Hunk #4 succeeded at 778 (offset -7 lines).
Hunk #5 succeeded at 845 with fuzz 2 (offset -7 lines).
Hunk #6 succeeded at 857 (offset -7 lines).
patching file Makefile
Hunk #1 succeeded at 167 (offset 1 line).
Hunk #2 succeeded at 272 (offset 4 lines).
Hunk #3 succeeded at 483 (offset 6 lines).
Hunk #4 succeeded at 968 (offset 9 lines).
The next patch would create the file,
which already exists! Skipping patch.
1 out of 1 hunk ignored
==> ERRO: Uma falha ocorreu em prepare().

intelfx commented on 2016-10-06 05:42


You should uninstall foomatic-db-foo2zjs and keep this package (foo2zjs). The extra/foomatic-db package contains unrelated drivers -- install it if you have other printers supported by Foomatic itself, otherwise it is not needed.

GregoD commented on 2016-10-06 04:22

Sorry for my ignorance, but I don't understand what has happened. Should I uninstall this and foomatic-db-foo2zjs and install only foomatic-db from Extra?

intelfx commented on 2016-10-05 05:38

Package updated. Gotta make this a -nightly with a pkgver(), I guess...

intelfx commented on 2016-10-04 08:01

Or not: this actually is a new version, the changelog was just bumped.

intelfx commented on 2016-10-04 07:48

Yes, looks like I've missed an update due to overzealous caching of source files. Fixed.

petres commented on 2016-10-04 07:44

Maybe a new update:
==> Validating source files with sha256sums...
foo2zjs.tar.gz ... FAILED

intelfx commented on 2016-10-04 06:21

From now on, foo2zjs is decoupled from foomatic-db and does not require using the patched foomatic-db-foo2zjs package (nor does it require foomatic-db at all).

el_Salmon commented on 2016-09-14 18:18

Please, update the first sha256sum to (today 2016-09-14): 0e04ecf67c38538dd463a1b635d43339dbdbe018af96fe6d2828668852d5c6e7

teateawhy commented on 2016-09-04 01:05

Fails to verify the source files.

petres commented on 2016-06-07 10:45

Can you try again,
I adjusted the patch file

scan commented on 2016-06-06 15:43

==> Iniciando build()…
patching file Makefile
Hunk #3 succeeded at 246 (offset -2 lines).
Hunk #4 succeeded at 644 (offset -9 lines).
Hunk #5 succeeded at 653 (offset -9 lines).
Hunk #6 succeeded at 707 (offset -9 lines).
Hunk #7 FAILED at 848. <----------------------------------- FAILED
Hunk #8 succeeded at 900 (offset -9 lines).
Hunk #9 succeeded at 926 (offset -9 lines).
1 out of 9 hunks FAILED -- saving rejects to file Makefile.rej
==> ERROR: Se produjo un fallo en build().
==> ERROR: Makepkg no ha podido compilar foo2zjs.
==> ¿Reiniciar la compilación de foo2zjs? [s/N]

petres commented on 2016-06-01 20:26

I will try to update the sha256sum as often as possible, if someone else would like to do it, dont hesitate and I will disown the package.

shtrom commented on 2016-03-27 07:34

20160313 is c9e7b346ecb737228099a6582e6ea224673b7d334ede43ad614308b2e7cad490

v1ron commented on 2016-03-23 13:16

20160122 is c9e7b346ecb737228099a6582e6ea224673b7d334ede43ad614308b2e7cad490

crust123 commented on 2016-03-20 03:44

Checksum error again. Replaced the first line of the sha256sums in the PKGBUILD with c9e7b346ecb737228099a6582e6ea224673b7d334ede43ad614308b2e7cad490 sorted things.

dreieck commented on 2016-02-18 09:45

sha256sum changed. Package seems be outdated. Please update/ correct.

chapatt commented on 2016-01-25 18:33

foo2zjs.tar.gz changed upstream. The new checksum is: 654c6febb6a0b5259a3d5ca6e7217aa3cacdcf21bde4ca7f15848f7ffe3226c2

Here's the PKGBUILD with the checksum updated:

a7arch commented on 2016-01-25 07:00

Same problem with the latest version (foo2zjs 20151105).
yaourt says that the sha256sum for the package is wrong!
So I can't build and install it, and I have same problem with the foo2zjs-utils package... :-(

From the Terminal: (in german, sorry)
==> Empfange Quellen...
-> Lade foo2zjs-20151105.tar.gz herunter...
% Total % Received % Xferd Average Speed Time Time Time Current
Dload Upload Total Spent Left Speed
100 1672k 100 1672k 0 0 361k 0 0:00:04 0:00:04 --:--:-- 361k
-> destdir-support-20140329-1.patch gefunden
-> gen-fixes-20140329-1.patch gefunden
-> firmware-loader-20130602-1.patch gefunden
-> udev-firmware-loading-ruleset-20130601-1.patch gefunden
==> Überprüfe Gültigkeit der Quell-Dateien mit sha256sums...
foo2zjs-20151105.tar.gz ... FEHLGESCHLAGEN
destdir-support-20140329-1.patch ... Durchgelaufen
gen-fixes-20140329-1.patch ... Durchgelaufen
firmware-loader-20130602-1.patch ... Durchgelaufen
udev-firmware-loading-ruleset-20130601-1.patch ... Durchgelaufen
==> FEHLER: Eine oder mehrere Dateien überstanden nicht die Gültigkeits-Prüfung!
==> FEHLER:Makepkg konnte foo2zjs nicht erstellen.

amos commented on 2015-11-06 10:56

The sha256sum for foo2zjs-20151024.tar.gz appears to be wrong and the build fails.

I get: f73ade10cdea80a8ef8df37a135d494034e9b225e47273d1c44d6cd70151ee77
As opposed to PKGBUILD: 78247fda3daf531be1dc07830b6f96f59c6c3461a14220f1a5faeee933c84fa1
(which is also the SHA1 of foo2zjs-20151011.tar.gz, apparently.

HanFox commented on 2015-10-25 14:10

The sha256sum for foo2zjs-20151011.tar.gz appears to be wrong and the build fails.

I get: 78247fda3daf531be1dc07830b6f96f59c6c3461a14220f1a5faeee933c84fa1

gok commented on 2015-10-20 07:31

A new version is available: 20151011
The sha256sum is 41ac200b17b547f3aa2d2aea8c220677273dcb7ecfbfec3c64cee2156898ea4c

GregoD commented on 2015-10-11 21:55

-> destdir-support-20140329-1.patch ha sido encontrado
-> gen-fixes-20140329-1.patch ha sido encontrado
-> firmware-loader-20130602-1.patch ha sido encontrado
-> udev-firmware-loading-ruleset-20130601-1.patch ha sido encontrado
==> Validando las fuentes con sha256sums...
foo2zjs-20150704.tar.gz ... HA FALLADO
destdir-support-20140329-1.patch ... Aprobado
gen-fixes-20140329-1.patch ... Aprobado
firmware-loader-20130602-1.patch ... Aprobado
udev-firmware-loading-ruleset-20130601-1.patch ... Aprobado
==> ERROR: ¡Uno o más archivos no superaron el control de validación!
==> ERROR: Makepkg no ha podido compilar foo2zjs.