Package Details: freecad-git 2:0.18.r2576.g953b802f83-1

Git Clone URL: https://aur.archlinux.org/freecad-git.git (read-only)
Package Base: freecad-git
Description: A general purpose 3D CAD modeler - git checkout
Upstream URL: https://www.freecadweb.org/
Licenses: LGPL
Conflicts: freecad
Provides: freecad
Submitter: gborzi
Maintainer: greyltc (lonaowna)
Last Packager: lonaowna
Votes: 89
Popularity: 0.79
First Submitted: 2012-03-03 13:46
Last Updated: 2019-11-04 14:26

Latest Comments

« First ‹ Previous ... 4 5 6 7 8 9 10 11 12 13 14 ... Next › Last »

D_Schwartfeger commented on 2018-03-05 08:50

I see this is a problem with aur-opencascade7 and the AUR page has comments about how to fix this

D_Schwartfeger commented on 2018-03-05 07:51

On Manjaro Kde it fails with-

/tmp/yaourt-tmp-donald/aur-opencascade7/src/occt-V7_2_0/src/IVtkVTK/IVtkVTK_ShapeData.cxx:83:18: error: 'class vtkIdTypeArray' has no member named 'InsertNextTupleValue'; did you mean 'InsertNextTuple'?

D_Schwartfeger commented on 2018-03-05 05:12

On Manjaro under KDE package didn't build with error-

<hr>

/tmp/yaourt-tmp-donald/aur-opencascade7/src/occt-V7_2_0/src/IVtkVTK/IVtkVTK_ShapeData.cxx: In member function 'virtual void IVtkVTK_ShapeData::InsertVertex(IVtk_IdType, IVtk_PointId, IVtk_MeshType)': /tmp/yaourt-tmp-donald/aur-opencascade7/src/occt-V7_2_0/src/IVtkVTK/IVtkVTK_ShapeData.cxx:83:18: error: 'class vtkIdTypeArray' has no member named 'InsertNextTupleValue'; did you mean 'InsertNextTuple'? mySubShapeIDs->InsertNextTupleValue (&aShapeIDVTK); ^~~~~~~~~~~~~~~~~~~~ InsertNextTuple /tmp/yaourt-tmp-donald/aur-opencascade7/src/occt-V7_2_0/src/IVtkVTK/IVtkVTK_ShapeData.cxx:85:16: error: 'class vtkIdTypeArray' has no member named 'InsertNextTupleValue'; did you mean 'InsertNextTuple'? myMeshTypes->InsertNextTupleValue (&aType); ^~~~~~~~~~~~~~~~~~~~ InsertNextTuple /tmp/yaourt-tmp-donald/aur-opencascade7/src/occt-V7_2_0/src/IVtkVTK/IVtkVTK_ShapeData.cxx: In member function 'virtual void IVtkVTK_ShapeData::InsertLine(IVtk_IdType, IVtk_PointId, IVtk_PointId, IVtk_MeshType)': /tmp/yaourt-tmp-donald/aur-opencascade7/src/occt-V7_2_0/src/IVtkVTK/IVtkVTK_ShapeData.cxx:100:18: error: 'class vtkIdTypeArray' has no member named 'InsertNextTupleValue'; did you mean 'InsertNextTuple'? mySubShapeIDs->InsertNextTupleValue (&aShapeIDVTK); ^~~~~~~~~~~~~~~~~~~~ InsertNextTuple /tmp/yaourt-tmp-donald/aur-opencascade7/src/occt-V7_2_0/src/IVtkVTK/IVtkVTK_ShapeData.cxx:102:16: error: 'class vtkIdTypeArray' has no member named 'InsertNextTupleValue'; did you mean 'InsertNextTuple'? myMeshTypes->InsertNextTupleValue (&aType); ^~~~~~~~~~~~~~~~~~~~ InsertNextTuple /tmp/yaourt-tmp-donald/aur-opencascade7/src/occt-V7_2_0/src/IVtkVTK/IVtkVTK_ShapeData.cxx: In member function 'virtual void IVtkVTK_ShapeData::InsertLine(IVtk_IdType, const IVtk_PointIdList, IVtk_MeshType)': /tmp/yaourt-tmp-donald/aur-opencascade7/src/occt-V7_2_0/src/IVtkVTK/IVtkVTK_ShapeData.cxx:127:20: error: 'class vtkIdTypeArray' has no member named 'InsertNextTupleValue'; did you mean 'InsertNextTuple'? mySubShapeIDs->InsertNextTupleValue (&aShapeIDVTK); ^~~~~~~~~~~~~~~~~~~~ InsertNextTuple /tmp/yaourt-tmp-donald/aur-opencascade7/src/occt-V7_2_0/src/IVtkVTK/IVtkVTK_ShapeData.cxx:129:18: error: 'class vtkIdTypeArray' has no member named 'InsertNextTupleValue'; did you mean 'InsertNextTuple'? myMeshTypes->InsertNextTupleValue (&aType); ^~~~~~~~~~~~~~~~~~~~ InsertNextTuple /tmp/yaourt-tmp-donald/aur-opencascade7/src/occt-V7_2_0/src/IVtkVTK/IVtkVTK_ShapeData.cxx: In member function 'virtual void IVtkVTK_ShapeData::InsertTriangle(IVtk_IdType, IVtk_PointId, IVtk_PointId, IVtk_PointId, IVtk_MeshType)': /tmp/yaourt-tmp-donald/aur-opencascade7/src/occt-V7_2_0/src/IVtkVTK/IVtkVTK_ShapeData.cxx:146:18: error: 'class vtkIdTypeArray' has no member named 'InsertNextTupleValue'; did you mean 'InsertNextTuple'? mySubShapeIDs->InsertNextTupleValue (&aShapeIDVTK); ^~~~~~~~~~~~~~~~~~~~ InsertNextTuple /tmp/yaourt-tmp-donald/aur-opencascade7/src/occt-V7_2_0/src/IVtkVTK/IVtkVTK_ShapeData.cxx:148:16: error: 'class vtkIdTypeArray' has no member named 'InsertNextTupleValue'; did you mean 'InsertNextTuple'? myMeshTypes->InsertNextTupleValue (&aType); ^~~~~~~~~~~~~~~~~~~~ InsertNextTuple make[2]: [src/TKIVtk/CMakeFiles/TKIVtk.dir/build.make:327: src/TKIVtk/CMakeFiles/TKIVtk.dir/__/IVtkVTK/IVtkVTK_ShapeData.cxx.o] Error 1 make[1]: [CMakeFiles/Makefile2:1461: src/TKIVtk/CMakeFiles/TKIVtk.dir/all] Error 2 make: ** [Makefile:130: all] Error 2 ==> ERROR: A failure occurred in build(). Aborting... ==> ERROR: Makepkg was unable to build opencascade7. ==> Restart building opencascade7 ? [y/N]

<hr>

heng commented on 2018-03-02 20:27

netgen-nogui-occ7 can be compiled using occ 7.1.0, after that freecad-qt5-git compiles just fine.

Grawp commented on 2018-02-25 11:21

Would anybody be interested in freecad git package with python3 and qt5? I have working PKGBUILD but I'm not sure whether it's worth uploading it to AUR to have yet another freecad package.

dulouie commented on 2018-02-04 20:09

You can remove -DBUILD_FEM_NETGEN=1 from PKGBUILD or use the Appimage pre_17 from freecad release page. https://github.com/FreeCAD/FreeCAD/releases

boscaiolo commented on 2018-02-02 16:07

The AppImage runs for me, but Freecad do not yet have an AppImage of the latest version (0.17).

boscaiolo commented on 2018-02-01 10:10

Is there any way round this problem (netgen-nogui-occ7 not compiling)? It would be great to have 0.17...

ElektroQuark commented on 2018-01-26 06:35

It can't be installed as the needed version of netgen-nogui-occ7 will not compile as some headers are missing.

zoidberg commented on 2017-12-01 16:08

Build of package fails with following output:

[ 72%] Building CXX object src/Gui/CMakeFiles/FreeCADGui.dir/Splashscreen.cpp.o
[ 72%] Linking CXX shared library ../../../../Mod/TechDraw/TechDraw.so
[ 72%] Building CXX object src/Gui/CMakeFiles/FreeCADGui.dir/WidgetFactory.cpp.o
/home/kishore/.cache/pacaur/freecad-qt5-git/src/freecad-qt5-git/src/Gui/WidgetFactory.cpp:80:11: fatal error: typeresolver.h: No such file or directory
# include <typeresolver.h>
^~~~~~~~~~~~~~~~
compilation terminated.
make[2]: *** [src/Gui/CMakeFiles/FreeCADGui.dir/build.make:7516: src/Gui/CMakeFiles/FreeCADGui.dir/WidgetFactory.cpp.o] Error 1
make[2]: *** Waiting for unfinished jobs....
[ 73%] Built target TechDraw
make[1]: *** [CMakeFiles/Makefile2:5377: src/Gui/CMakeFiles/FreeCADGui.dir/all] Error 2
make: *** [Makefile:130: all] Error 2
==> ERROR: A failure occurred in build().
Aborting...
:: failed to build freecad-qt5-git package(s)